{"text_format":"1","workbook":"xlsx","n_sheets":36,"sheets":["Instructions","menu","Help text","i_SchoolInfo","i_Settings","i_IntDesc","i_StudentInfo","i_pre-HS","i_RawPreHS","i_exam","i_RawExam","i_PerfData","i_RawPerf","c_IndCalcs","c_ProcessedInt","c_ReportData","i_Int","i_ReportFilters","i_StudentReportFields","i_PresetFilters","i_FullYearReportDefs","o_IntSum","o_StudentDetail","o_StudentLevelRpt","o_SchSuccessRpt","o_IndSummary","o_EnrollStatusSum","o_SchIntSumType","o_SchIntSum","o_Tier_Int","o_IndDisability","o_IndELL","o_IndDis","Changelog","FieldNames","AdvancedFilter"],"not_rendered":{"charts":14,"images":2,"macros":1,"external_links":0,"defined_names":223,"comments":0,"pivot_tables":0},"unopened":[],"bounds":{"document_bytes":16777216,"sheet_cells":100000,"rows_first":2000,"rows_last":500,"rows_between":2000,"halvings":0,"cell_chars":16384,"cell_head_chars":4096},"cells_cut":0,"cells_raw":0,"read":"whole","date_system":"1900"}

{"sheet":"Instructions","index":0,"n_rows":44,"n_cols":8,"rows_kept":44,"cut":false,"hidden":false,"merged":[[4,7,4,8],[6,1,6,8],[7,1,7,8],[3,1,3,8],[43,1,48,8],[30,1,30,8],[5,9,5,16],[5,1,5,8],[31,1,34,8],[35,1,37,8],[42,1,42,8],[10,1,10,8],[21,1,21,8],[11,1,11,8],[12,1,12,8],[13,1,13,8],[15,1,15,8],[19,1,19,8],[20,1,20,8]]}
[]
[]
[]
[null,"Early Warning System Middle Grades Tool"]
[null,"Mindee O'Cummings, Susan Therriault, Jessica Heppen, Laura Yerhot, Michelle Perry and Matthew Hauenstein",null,null,null,null,null,"November 2011"]
[null,"Warning: Macros must be enabled for this tool to function correctly"]
{"$rows_left_out":39}
{"sheet":"menu","index":1,"n_rows":7,"n_cols":15,"rows_kept":7,"cut":false,"hidden":false,"merged":[[6,8,6,10],[6,2,6,4],[1,1,3,17]]}
[]
[null,"EWS MG Tool"]
[]
[]
[]
[]
{"$rows_left_out":2}
{"sheet":"Help text","index":2,"n_rows":74,"n_cols":6,"rows_kept":74,"cut":false,"hidden":false,"merged":[[3,1,4,3]]}
[]
[]
[]
[null,"Help Text Editor"]
[]
[]
{"$rows_left_out":69}
{"sheet":"i_SchoolInfo","index":3,"n_rows":39,"n_cols":5,"rows_kept":39,"cut":false,"hidden":false,"merged":[[1,1,1,4],[22,2,22,3],[11,2,11,3],[14,2,14,3],[15,2,15,3],[2,1,2,3],[3,1,4,4],[12,2,12,3]]}
[]
[null,"Tool Setup 1/3"]
[]
[null,"School Information"]
[]
[]
{"$rows_left_out":34}
{"sheet":"i_Settings","index":4,"n_rows":38,"n_cols":18,"rows_kept":38,"cut":false,"hidden":false,"merged":[[31,6,31,8],[34,13,34,15],[35,13,36,13],[35,14,36,15],[36,2,36,3],[32,2,32,3],[33,2,33,3],[34,2,34,3],[31,2,31,3],[35,7,36,8],[35,2,35,3],[28,2,28,3],[29,2,29,3],[30,2,30,3],[28,6,28,8],[29,6,29,8],[30,6,30,8],[1,1,1,8],[3,1,4,8],[10,6,10,8],[20,2,20,3],[21,2,21,3],[16,2,16,3],[17,2,17,3],[18,2,18,3],[19,2,19,3],[26,2,26,3],[27,2,27,3],[37,13,39,15],[2,1,2,8],[22,6,23,8],[33,6,33,8],[24,6,24,8],[25,6,25,8],[26,6,26,8],[27,6,27,8],[32,6,32,8],[25,2,25,3],[22,2,22,3],[23,2,23,3],[24,2,24,3],[35,6,36,6]]}
[]
[null,"Tool Setup 2/3"]
[]
[null,"Tool Settings"]
[]
[]
{"$rows_left_out":33}
{"sheet":"i_IntDesc","index":5,"n_rows":14,"n_cols":7,"rows_kept":14,"cut":false,"hidden":false,"merged":[[3,1,4,4],[1,1,1,4]]}
[]
[null,"Tool Setup 3/3"]
[]
[null,"Intervention Settings"]
[]
[]
{"$rows_left_out":9}
{"sheet":"i_StudentInfo","index":6,"n_rows":73,"n_cols":31,"rows_kept":73,"cut":false,"hidden":false,"merged":[[1,1,1,3],[10,21,11,21],[10,12,11,17],[10,18,11,20],[10,4,11,10],[10,1,11,3],[3,1,4,3],[10,11,11,11]]}
[]
[null,"Data Input 1/4"]
[]
[null,"Student Information"]
[]
[]
{"$rows_left_out":68}
{"sheet":"i_pre-HS","index":7,"n_rows":62,"n_cols":24,"rows_kept":62,"cut":false,"hidden":false,"merged":[[9,4,10,12],[3,1,4,5],[9,1,10,3],[1,1,1,5]]}
[]
[null,"Data Input 2/4"]
[]
[null,"Student Incoming Risk Status"]
[]
[]
{"$rows_left_out":57}
{"sheet":"i_RawPreHS","index":8,"n_rows":32,"n_cols":12,"rows_kept":32,"cut":false,"hidden":true,"merged":[]}
["Student ID","Exit Indicator","Semester 2 Flag for Attendance","Semester 2 Flag for English Course Failed","Semester 2 Flag for Math Course Failed","Semester 2 Flag for Behavior","End of Year Flag for Year Attendance","End of Year Flag for English Course Failed","End of Year Flag for Math Course Failed","End of Year Flag for Behavior","First Name","Last Name"]
["01","No","--","--","--","--","--","--","--","--","Christian","Manner"]
["2","Yes","No","Yes","No","--","No","Yes","No","--","Nelson","Linck"]
["3","Yes","No","No","Yes","--","No","No","Yes","--","Lindsay","Catriona"]
["4","Yes","No","Yes","No","--","No","Yes","No","--","Ted","Uy"]
["5","Yes","No","Yes","No","--","No","Yes","No","--","Hugh","Steck"]
{"$rows_left_out":27}
{"sheet":"i_exam","index":9,"n_rows":62,"n_cols":16,"rows_kept":62,"cut":false,"hidden":false,"merged":[[1,1,1,5],[3,1,4,5],[9,1,10,3],[9,4,10,8]]}
[]
[null,"Data Input 3/4"]
[]
[null,"Student Exam Performance"]
[]
[]
{"$rows_left_out":57}
{"sheet":"i_RawExam","index":10,"n_rows":30,"n_cols":6,"rows_kept":30,"cut":false,"hidden":true,"merged":[]}
[1,"Yes","test1","test2","test3","test4"]
[2]
[3,"Yes"]
[4,null,"test1","test2","test3","test4"]
[5,"Yes"]
[6,"No"]
{"$rows_left_out":25}
{"sheet":"i_PerfData","index":11,"n_rows":18,"n_cols":38,"rows_kept":18,"cut":false,"hidden":false,"merged":[[1,2,1,5],[8,2,8,3],[10,2,11,4],[10,25,11,28],[10,8,11,12],[10,13,11,16],[10,17,11,20],[10,5,11,5],[10,21,11,24],[3,2,4,6],[10,6,11,6],[10,7,11,7]]}
[]
[null,null,"           Data Input 4/4"]
[]
[null,null,"Student Performance"]
[]
[]
{"$rows_left_out":13}
{"sheet":"i_RawPerf","index":12,"n_rows":30,"n_cols":4,"rows_kept":30,"cut":false,"hidden":true,"merged":[]}
["1",1,1,0]
["2",1,1,0]
["3",3,0,1]
["4",4,1,0]
["5",3,1,0]
["6",2,0,0]
{"$rows_left_out":25}
{"sheet":"c_IndCalcs","index":13,"n_rows":23,"n_cols":47,"rows_kept":23,"cut":false,"hidden":false,"merged":[[10,35,11,38],[10,7,11,7],[10,3,11,5],[10,8,11,8],[3,3,4,8],[6,5,6,7],[7,5,7,7],[10,29,11,32],[8,5,8,7],[9,3,9,8],[10,10,11,14],[10,17,11,20],[10,23,11,26]]}
[]
[]
[]
[null,null,null,"Student Risk Status"]
[]
[]
{"$rows_left_out":18}
{"sheet":"c_ProcessedInt","index":14,"n_rows":1,"n_cols":9,"rows_kept":1,"cut":false,"hidden":true,"merged":[]}
[null,null,null,null,null,null,null,null,{"$f":"COUNTA(A:A)","v":0}]

{"sheet":"c_ReportData","index":15,"n_rows":13,"n_cols":110,"rows_kept":13,"cut":false,"hidden":true,"merged":[]}
[null,null,null,null,null,null,null,null,null,null,null,null,null,null,null,null,null,null,null,null,null,null,null,null,null,null,null,null,null,null,null,null,null,null,null,null,null,null,null,null,null,null,null,null,null,null,null,null,null,null,null,null,null,null,null,null,null,null,null,null,null,null,null,null,null,null,null,null,null,null,null,null,null,null,null,null,null,null,null,null,null,null,null,null,null,null,null,null,null,null,null,null,null,null,null,null,null,null,null,null,null,null,null,null,null,null,null,null,{"$f":"COUNTA(CU:CU)-1","v":1}]
["[Select a field name]","[Select a field name]","[Select a field name]","[Select a field name]","[Select a field name]","[Select a field name]","[Select a field name]","[Select a field name]","[Select a field name]","[Select a field name]"]
[]
[]
[]
[]
{"$rows_left_out":8}
{"sheet":"i_Int","index":16,"n_rows":25,"n_cols":43,"rows_kept":25,"cut":false,"hidden":false,"merged":[[14,7,15,7],[23,27,23,28],[16,1,16,2],[17,1,17,2],[18,1,18,2],[19,1,19,2],[20,1,20,2],[22,1,23,8],[24,4,24,5],[21,1,21,7],[3,1,4,8],[6,3,6,8],[10,2,10,3],[11,2,11,3],[8,5,8,6],[9,5,9,6],[10,5,10,6],[12,4,12,5],[11,5,11,6],[12,2,12,3],[14,3,15,3],[14,4,15,4],[14,5,15,5],[14,6,15,6]]}
[]
[]
[]
[null,"Student Interventions"]
[]
[]
{"$rows_left_out":20}
{"sheet":"i_ReportFilters","index":17,"n_rows":99,"n_cols":35,"rows_kept":99,"cut":false,"hidden":false,"merged":[[38,1,39,1],[42,1,43,1],[19,3,20,4],[1,1,2,6],[11,3,11,4],[7,1,7,2],[11,5,11,6],[7,3,7,4]]}
[]
[null,"Reports Control Panel",null,null,null,null,null,null,null,null,null,null,null,null,null,null,null,null,"Report lookup:",{"$f":"IF(INDEX(OFFSET(StuLvlRpts,0,1),StudentReportNumber)=\"Yes\",INDEX($AD$5:$AD$10,StudentReportTime),\"\")&INDEX(StuLvlRpts,StudentReportNumber)","v":"GP1Custom report 1"},null,null,null,null,null,null,null,null,null,null,null,null,null,null,{"$f":"INDEX($AI$5:$AI$15,$D$9)","v":"All"}]
[null,null,null,null,null,null,null,null,null,null,null,null,null,null,null,null,null,null,"GP1Custom report 1",{"$f":"IF(INDEX(OFFSET(StuLvlRpts,0,1),StudentReportNumber)=\"Yes\",INDEX($AD$5:$AD$10,$C$13),\"\")&INDEX(StuLvlRpts,StudentReportNumber)","v":"GP1Custom report 1"},null,null,null,null,null,null,null,null,null,null,null,null,null,null,{"$f":"INDEX($AI$5:$AI$15,$F$13)","v":"All"}]
[null,null,null,null,null,null,null,null,null,null,null,null,null,null,null,null,"DescSize",{"$f":"INDEX($Q$5:$Q$20,StudentReportNumber)","v":17},"Student reports","time frame","extra calc","label1","label2","label3","denom","Description","Sum flags?",null,null,null,"Fields","School reports","sheet",null,"N/A"]
[null,null,null,null,null,null,null,null,null,null,null,null,null,null,null,null,34,null,"Flagged Student Report","Yes","Yes","Total Students:","Flagged Students:","% Flagged:",{"$f":"IF(StudentReportTime=5,SUMPRODUCT((EOY_status<>0)*(StudCohortReport=1)),IF(StudentReportTime>4,SUM(StudCohortReport),SUMPRODUCT((INDIRECT(INDEX($AH$5:$AH$8,StudentReportTime))<>0)*(StudCohortReport=1))))","v":1},"This report shows a list of students who are flagged for any indicators of risk and for which indicators they are flagged for the selected grading period or time frame.","Yes",1,{"$f":"i_Settings!B12","v":"Quarter 1"},"GP1","[Select a field name]","Risk Indicator Summary Report","o_IndSummary","ArrGP1_days","All"]
[null,null,null,null,null,null,null,null,null,null,null,null,null,null,null,null,34,"disability_flag","Flagged Student Report: Disabilities","Yes","Yes","Total Students With Disabilities:","Total Students With Disabilities Flagged:","% Students With Disabilities Flagged:",{"$f":"IF(StudentReportTime=5,SUMPRODUCT((Disability_flag=1)*(EOY_status<>0)*(StudCohortReport=1)),IF(StudentReportTime>4,SUMPRODUCT((Disability_flag=1)*(StudCohortReport=1)),SUMPRODUCT((Disability_flag=1)*(INDIRECT(INDEX($AH$5:$AH$8,StudentReportTime))<>0)*(StudCohortReport=1))))","v":0},"This report shows a list of students with disabilities who are flagged for any indicators of risk, for which indicators they are flagged, and their assigned interventions for the selected grading period or time frame.","Yes",2,{"$f":"i_Settings!B13","v":"Quarter 2"},"GP2",{"$f":"IF(OFFSET(FieldNames!$E2,0,GP_Type)=\"\",\"\",OFFSET(FieldNames!$E2,0,GP_Type))","v":"Last Name"},"Risk Indicator Summary Report: Disability Categories","o_IndDisability","ArrGP2_days",{"$f":"IF(i_Settings!G25=\"\",\"\",i_Settings!G25)","v":"Cohort A"}]
{"$rows_left_out":94}
{"sheet":"i_StudentReportFields","index":18,"n_rows":124,"n_cols":29,"rows_kept":124,"cut":false,"hidden":true,"merged":[]}
[{"$f":"MATCH(ReportLookup,B:B,0)","v":91},"Report","F1","F2","F3","F4","F5","F6","F7","F8","F9","F10","F11","F12","F13","F14","F15","F16","F17","F18","F19","F20","F21","F22","F23","F24","F25","F26","F27"]
[null,"Incoming Indicator of Risk Report","Student ID","First Name","Last Name","Pre-HS indicator"]
[null,"GP1Flagged student report","Student ID","First Name","Last Name","Pre-HS indicator",{"$f":"\"GP1_First \"&EarlyAtt&\" Day Attendance\"","v":"GP1_First 20 Day Attendance"},"GP1_Attendance","GP1_EngCourseFail","GP1_MathCourseFail","GP1_Behavior"]
[null,"GP2Flagged student report","Student ID","First Name","Last Name","GP2_Attendance","GP2_EngCourseFail","GP2_MathCourseFail","GP2_Behavior"]
[null,"GP3Flagged student report","Student ID","First Name","Last Name","GP3_Attendance","GP3_EngCourseFail","GP3_MathCourseFail","GP3_Behavior"]
[null,"GP4Flagged student report","Student ID","First Name","Last Name","GP4_Attendance","GP4_EngCourseFail","GP4_MathCourseFail","GP4_Behavior"]
{"$rows_left_out":119}
{"sheet":"i_PresetFilters","index":19,"n_rows":1063,"n_cols":9,"rows_kept":1063,"cut":false,"hidden":true,"merged":[[1,1,2,6]]}
[]
[null,"Pre-set Filters"]
[]
[]
[]
[]
{"$rows_left_out":1058}
{"sheet":"i_FullYearReportDefs","index":20,"n_rows":39,"n_cols":28,"rows_kept":39,"cut":false,"hidden":true,"merged":[]}
["Quarters","FullFlagged student report","Pre-HS indicator",{"$f":"\"GP1_First \"&EarlyAtt&\" Day Attendance\"","v":"GP1_First 20 Day Attendance"},"GP1_Attendance","GP1_EngCourseFail","GP1_MathCourseFail","GP1_Behavior","GP2_Attendance","GP2_EngCourseFail","GP2_MathCourseFail","GP2_Behavior","GP3_Attendance","GP3_EngCourseFail","GP3_MathCourseFail","GP3_Behavior","GP4_Attendance","GP4_EngCourseFail","GP4_MathCourseFail","GP4_Behavior","eoy_Attendance","eoy_EngCourseFail","eoy_MathCourseFail","eoy_Behavior"]
["Trimesters",null,"Pre-HS indicator","GP1_First 20 Day Attendance","GP1_Attendance","GP1_EngCourseFail","GP1_MathCourseFail","GP1_Behavior","GP2_Attendance","GP2_EngCourseFail","GP2_MathCourseFail","GP2_Behavior","GP3_Attendance","GP3_EngCourseFail","GP3_MathCourseFail","GP3_Behavior","eoy_Attendance","eoy_EngCourseFail","eoy_MathCourseFail","eoy_Behavior"]
["Semesters",null,"Pre-HS indicator","GP1_First 20 Day Attendance","GP1_Attendance","GP1_EngCourseFail","GP1_MathCourseFail","GP1_Behavior","GP2_Attendance","GP2_EngCourseFail","GP2_MathCourseFail","GP2_Behavior","eoy_Attendance","eoy_EngCourseFail","eoy_MathCourseFail","eoy_Behavior"]
["Quarters","FullFlagged student report: Academics","Pre-HS indicator","GP1_First 20 Day Attendance","GP1_Attendance","GP1_EngCourseFail","GP1_MathCourseFail","GP1_Behavior","GP2_Attendance","GP2_EngCourseFail","GP2_MathCourseFail","GP2_Behavior","GP3_Attendance","GP3_EngCourseFail","GP3_MathCourseFail","GP3_Behavior","GP4_Attendance","GP4_EngCourseFail","GP4_MathCourseFail","GP4_Behavior","eoy_Attendance","eoy_EngCourseFail","eoy_MathCourseFail","eoy_Behavior"]
["Trimesters",null,"Pre-HS indicator","GP1_First 20 Day Attendance","GP1_Attendance","GP1_EngCourseFail","GP1_MathCourseFail","GP1_Behavior","GP2_Attendance","GP2_EngCourseFail","GP2_MathCourseFail","GP2_Behavior","GP3_Attendance","GP3_EngCourseFail","GP3_MathCourseFail","GP3_Behavior","eoy_Attendance","eoy_EngCourseFail","eoy_MathCourseFail","eoy_Behavior"]
["Semesters",null,"Pre-HS indicator","GP1_First 20 Day Attendance","GP1_Attendance","GP1_EngCourseFail","GP1_MathCourseFail","GP1_Behavior","GP2_Attendance","GP2_EngCourseFail","GP2_MathCourseFail","GP2_Behavior","eoy_Attendance","eoy_EngCourseFail","eoy_MathCourseFail","eoy_Behavior"]
{"$rows_left_out":34}
{"sheet":"o_IntSum","index":21,"n_rows":27,"n_cols":28,"rows_kept":27,"cut":false,"hidden":false,"merged":[[11,12,12,15],[11,3,12,5],[3,3,4,8],[6,7,9,15],[11,6,12,10]]}
[]
[]
[]
[null,null,null,"Student Level Intervention Summary Report      "]
[]
[]
{"$rows_left_out":22}
{"sheet":"o_StudentDetail","index":22,"n_rows":39,"n_cols":17,"rows_kept":39,"cut":false,"hidden":false,"merged":[[30,5,30,6],[31,5,31,6],[24,4,24,5],[20,11,38,15],[19,4,20,5],[19,6,20,6],[19,7,20,7],[19,8,20,8],[19,9,20,9],[25,4,25,5],[38,5,38,6],[37,5,37,6],[33,5,33,6],[34,5,34,6],[35,5,35,6],[36,5,36,6],[11,6,11,7],[12,3,12,4],[13,3,13,4],[11,3,11,4],[15,8,15,9],[15,3,15,4],[13,6,13,7],[16,6,16,7],[23,4,23,5],[17,6,17,7],[15,6,15,7],[12,16,12,17],[14,6,14,7],[21,4,21,5],[22,4,22,5],[16,3,16,4],[14,3,14,4],[16,8,16,9],[17,8,17,9],[22,2,22,3],[11,12,11,13],[12,12,12,13],[10,8,10,9],[11,8,11,9],[12,8,12,9],[32,5,32,6],[3,11,6,15],[8,8,8,9],[28,5,28,6],[29,5,29,6],[3,2,4,9],[10,3,10,4],[23,2,23,3],[25,2,25,3],[24,2,24,3],[13,8,13,9],[14,8,14,9],[10,6,10,7],[12,6,12,7],[21,2,21,3],[10,12,10,13],[38,2,38,4],[28,2,28,4],[29,2,29,4],[30,2,30,4],[31,2,31,4],[32,2,32,4],[33,2,33,4],[34,2,34,4],[35,2,35,4],[36,2,36,4],[37,2,37,4]]}
[]
[]
[]
[null,null,"Detailed Student Report",null,null,null,null,null,null,null,null,"This report can be generated for each individual student and provides all information available in the tool for the selected student. Users can search by name or student ID to create a report for an individual student. Please refer to the 'More Info' button for additional information about this report."]
[]
[]
{"$rows_left_out":34}
{"sheet":"o_StudentLevelRpt","index":23,"n_rows":19,"n_cols":29,"rows_kept":19,"cut":false,"hidden":false,"merged":[[9,5,9,7],[10,5,10,7],[3,1,4,8],[13,1,13,8],[11,2,11,3],[9,2,9,3],[12,2,12,3],[8,2,8,4],[8,5,8,7],[10,2,10,3]]}
[]
[]
[]
[null,"Student Level Report"]
[]
[]
{"$rows_left_out":14}
{"sheet":"o_SchSuccessRpt","index":24,"n_rows":33,"n_cols":30,"rows_kept":33,"cut":false,"hidden":false,"merged":[[20,1,20,3],[18,1,18,3],[3,1,4,11],[6,10,6,11],[9,1,12,11],[6,1,6,2],[17,1,17,3],[19,1,19,3],[7,3,7,6]]}
[]
[]
[]
[null,"Incoming Indicator of Risk Transition Report"]
[]
[null,null,null,null,null,null,null,null,null,null,null,null,null,null,null,null,null,null,null,null,null,null,{"$f":"COUNTA(C30:H30)-COUNTBLANK(C30:H30)","v":6},{"$f":"IF(D8=\"All\",\"*\",D8)","v":"*"}]
{"$rows_left_out":28}
{"sheet":"o_IndSummary","index":25,"n_rows":21,"n_cols":24,"rows_kept":21,"cut":false,"hidden":false,"merged":[[12,1,13,10],[3,1,4,10],[9,1,9,2],[10,1,10,2],[6,1,6,2],[6,9,6,10],[7,3,7,6]]}
[]
[]
[]
[null,"Risk Indicator Summary Report"]
[]
[null,null,null,null,null,null,null,null,null,null,null,null,null,null,null,null,{"$f":"COUNTA(C18:I18)-COUNTBLANK(C18:I18)","v":6},{"$f":"IF($D$7=5,4,$D$7)","v":1},{"$f":"IF(D8=\"All\",\"*\",D8)","v":"*"}]
{"$rows_left_out":16}
{"sheet":"o_EnrollStatusSum","index":26,"n_rows":37,"n_cols":30,"rows_kept":37,"cut":false,"hidden":false,"merged":[[6,1,6,2],[6,13,6,14],[9,1,12,7],[7,3,7,6],[3,1,4,14]]}
[]
[]
[]
[null,"Enrollment Status Summary Report"]
[]
[null,null,null,null,null,null,null,null,null,null,null,null,null,null,null,null,null,null,null,null,null,null,null,null,null,null,{"$f":"IF(D8=\"All\",\"*\",D8)","v":"*"}]
{"$rows_left_out":32}
{"sheet":"o_SchIntSumType","index":27,"n_rows":20,"n_cols":16,"rows_kept":20,"cut":false,"hidden":false,"merged":[[19,1,19,4],[6,1,6,2],[3,1,4,11],[6,10,6,11],[16,1,16,4],[17,1,17,4],[18,1,18,4],[9,1,14,5],[7,3,7,6]]}
[]
[]
[]
[null,"Intervention Summary Report: Type"]
[]
[null,null,null,null,null,null,null,null,null,null,null,null,null,null,{"$f":"IF(D8=\"All\",\"*\",D8)","v":"*"}]
{"$rows_left_out":15}
{"sheet":"o_SchIntSum","index":28,"n_rows":20,"n_cols":50,"rows_kept":20,"cut":false,"hidden":false,"merged":[[3,1,4,11],[6,10,6,11],[6,1,6,2],[7,1,7,2],[10,1,12,11],[8,3,8,6]]}
[]
[]
[]
[null,"Intervention Summary Report: Program"]
[null,null,null,null,null,null,null,null,null,null,null,null,null,null,null,null,null,null,null,null,null,null,null,null,null,{"$f":"IF(D9=\"All\",\"*\",D9)","v":"*"},{"$f":"IF(GP_Type=3,1,IF(GP_Type=2,4,8))","v":8},{"$f":"COLUMN(c_ReportData!CN1)","v":92}]
[null,null,null,null,null,null,null,null,null,null,null,null,null,null,null,null,null,null,{"$f":"INDEX($S$7:$S$10,$D$7)","v":"Disability_flag"},null,null,null,null,null,{"$f":"INDEX(CurrInterventions,$D$8)","v":0},{"$f":"INDEX(i_IntDesc!$C$12:$C$41,$D$8)","v":0},null,"Attendance"]
{"$rows_left_out":15}
{"sheet":"o_Tier_Int","index":29,"n_rows":19,"n_cols":16,"rows_kept":19,"cut":false,"hidden":false,"merged":[[18,1,18,4],[3,1,4,11],[6,1,6,2],[6,10,6,11],[15,1,15,4],[16,1,16,4],[17,1,17,4],[9,1,13,5],[7,3,7,6]]}
[]
[]
[]
[null,"Intervention Summary Report: Tiers"]
[]
[null,null,null,null,null,null,null,null,null,null,null,null,null,null,{"$f":"IF(D8=\"All\",\"*\",D8)","v":"*"}]
{"$rows_left_out":14}
{"sheet":"o_IndDisability","index":30,"n_rows":51,"n_cols":20,"rows_kept":51,"cut":false,"hidden":false,"merged":[[9,1,9,4],[10,1,10,4],[11,1,11,4],[3,1,4,11],[6,1,6,2],[6,10,6,11],[9,7,11,11],[7,3,7,6]]}
[]
[]
[]
[null,"Risk Indicator Summary Report: Disability Categories"]
[]
[null,null,null,null,null,null,null,null,null,null,null,null,null,null,null,{"$f":"IF(D8=\"All\",\"*\",D8)","v":"*"},null,{"$f":"INDEX($R$7:$R$14,$D$7)","v":28}]
{"$rows_left_out":46}
{"sheet":"o_IndELL","index":31,"n_rows":51,"n_cols":20,"rows_kept":51,"cut":false,"hidden":false,"merged":[[3,1,4,11],[6,1,6,2],[6,10,6,11],[9,1,9,4],[9,7,11,11],[10,1,10,4],[11,1,11,4],[7,3,7,6]]}
[]
[]
[]
[null,"Risk Indicator Summary Report: English Language Learner (ELL)"]
[]
[null,null,null,null,null,null,null,null,null,null,null,null,null,null,null,{"$f":"IF(D8=\"All\",\"*\",D8)","v":"*"},null,{"$f":"INDEX($R$7:$R$14,$D$7)","v":28}]
{"$rows_left_out":46}
{"sheet":"o_IndDis","index":32,"n_rows":51,"n_cols":20,"rows_kept":51,"cut":false,"hidden":false,"merged":[[11,1,11,4],[9,7,12,11],[3,1,4,11],[6,1,6,2],[6,10,6,11],[9,1,9,4],[10,1,10,4],[7,3,7,6]]}
[]
[]
[]
[null,"Risk Indicator Summary Report: Disadvantaged"]
[]
[null,null,null,null,null,null,null,null,null,null,null,null,null,null,null,{"$f":"IF(D8=\"All\",\"*\",D8)","v":"*"},null,{"$f":"INDEX($R$7:$R$14,$D$7)","v":59}]
{"$rows_left_out":46}
{"sheet":"Changelog","index":33,"n_rows":31,"n_cols":4,"rows_kept":31,"cut":false,"hidden":false,"merged":[[1,1,1,3]]}
[]
[null,"Change log started from version 0.86"]
[]
[]
[null,"Version","Changes","Date"]
[null,"3.0e"," - Hidden the filter buttons in the risk status sheet\n - Fixed a formatting bug in the performance data sheet where the greying out of rows for dropped/transferred out students was leaking into column A","2011-07-11"]
{"$rows_left_out":26}
{"sheet":"FieldNames","index":34,"n_rows":96,"n_cols":8,"rows_kept":96,"cut":false,"hidden":true,"merged":[]}
["ActualName","OutputName (with GP types)","OutputName (without GP types)","Type","New fieldname","Quarters","Trimesters","Semesters"]
["Last Name","Last Name",null,null,{"$f":"IF(B2=\"\",A2,B2)","v":"Last Name"},"Last Name","Last Name","Last Name"]
["First Name","First Name",null,null,"First Name","First Name","First Name","First Name"]
["Student ID","Student ID",null,null,"Student ID","Student ID","Student ID","Student ID"]
["Grade","Grade",null,null,"Grade","Grade","Grade","Grade"]
["Phone #","Phone #",null,null,"Phone #","Phone #","Phone #","Phone #"]
{"$rows_left_out":91}
{"sheet":"AdvancedFilter","index":35,"n_rows":2,"n_cols":2,"rows_kept":2,"cut":false,"hidden":true,"merged":[]}
["Password:","NHSCFilter"]
["status:","LOCKED"]