{"text_format":"1","workbook":"xlsx","n_sheets":36,"sheets":["Instructions","menu","Help text","i_SchoolInfo","i_Settings","i_IntDesc","i_StudentInfo","i_pre-HS","i_RawPreHS","i_exam","i_RawExam","i_PerfData","i_RawPerf","c_IndCalcs","c_ProcessedInt","c_ReportData","i_Int","i_ReportFilters","i_StudentReportFields","i_PresetFilters","i_FullYearReportDefs","o_IntSum","o_StudentDetail","o_StudentLevelRpt","o_SchSuccessRpt","o_IndSummary","o_EnrollStatusSum","o_SchIntSumType","o_SchIntSum","o_Tier_Int","o_IndDisability","o_IndELL","o_IndDis","Changelog","FieldNames","AdvancedFilter"],"not_rendered":{"charts":14,"images":2,"macros":1,"external_links":0,"defined_names":223,"comments":0,"pivot_tables":0},"unopened":[],"bounds":{"document_bytes":16777216,"sheet_cells":100000,"rows_first":2000,"rows_last":500,"rows_between":2000,"halvings":0,"cell_chars":16384,"cell_head_chars":4096},"cells_cut":0,"cells_raw":0,"read":"whole","date_system":"1900"}

{"sheet":"Instructions","index":0,"n_rows":44,"n_cols":8,"rows_kept":44,"cut":false,"hidden":false,"merged":[[4,7,4,8],[6,1,6,8],[7,1,7,8],[3,1,3,8],[43,1,48,8],[30,1,30,8],[5,9,5,16],[5,1,5,8],[31,1,34,8],[35,1,37,8],[42,1,42,8],[10,1,10,8],[21,1,21,8],[11,1,11,8],[12,1,12,8],[13,1,13,8],[15,1,15,8],[19,1,19,8],[20,1,20,8]]}
[]
[]
[]
[null,"Early Warning System Middle Grades Tool"]
[null,"Mindee O'Cummings, Susan Therriault, Jessica Heppen, Laura Yerhot, Michelle Perry and Matthew Hauenstein",null,null,null,null,null,"November 2011"]
[null,"Warning: Macros must be enabled for this tool to function correctly"]
[null,"ABOUT THE TOOL"]
[null,"The Early Warning System (EWS) Middle Grades Tool, developed by the National High School Center at the American Institutes for Research in collaboration with Matrix Knowledge Group, is designed to allow users to identify students who show early warning signs that they are at-risk for dropping out of school. The Tool automatically calculates indicators that are predictive of whether students advance or drop out. These indicators are related to attendance, course failures, and behavior. The Tool is designed to be used on a regular basis—after the first 20 or 30 days of school, and after every grading period thereafter."]
[]
[null,"The tool has three types of screens, as shown on the Main Menu: "]
[null,"(1)  Tool Setup screens allow you to customize the settings to your school or district (e.g. the number of grading or marking periods, the number of days per period)."]
[null,"(2)  Data Inputs screens allow you to import or enter student-level information including background information, incoming information (if available), and student performance data including attendance, course performance and behavior."]
[]
[null,"(3)  Outputs & Reports screens display student-level and summary information that identifies students who are at-risk. Click the “Student Risk Status” button to view all students and whether or not they are flagged as at-risk, and why (i.e. for which indicators are they flagged). From the Student Risk Status page, right-click on any student to Assign Interventions to that student. From the Main Menu, click the “Reports Control Panel” to find a host of student-level and school-level summary reports."]
[]
[null,"Additional information about establishing and implementing an Early Warning System is provided in the EWS Implementation Guide."]
[]
[]
[]
[null,"CREDITS TO RESEARCH"]
[null,"Strong foundational research points to the best indicators to use as flags for students who are at risk of dropping out. Recent research conducted primarily in large districts, including Chicago Public Schools (CPS) and Philadelphia Public Schools, demonstrates that indicators in the first year of high school and in middle school can predict whether students are on a path toward eventual graduation (Allensworth & Easton, 2005, 2007; Neild & Balfanz, 2006; Balfanz, 2009). This tool draws upon this research, particularly results reported by Balfanz (2009), for the calculation of indicators that suggest students in the middle grades are at-risk of not completing high school.  For more resources and research on Early Warning Systems and indicators of risk for dropout, please refer to the EWS Implementation Guide and our Web site at http://www.betterhighschools.org/ews.asp."]
[null,"We encourage users to make use of the default settings for the “Risk Indicator Thresholds” (shown on the “Tool Settings” screen), because they are based on solid research. However, the Tool does also allow experienced users to change the default settings to customize these “Risk Indicator Thresholds,” though we recommend seeking technical assistance before making such changes. In addition, due to the variation in how student behavior is measured, we have not created a default for the behavior risk indicator. Users wishing to track student behavior must create a custom threshold on the \"Tool Settings\" screen. "]
[]
[]
[]
[null,null,null,"         Copyright 2011 | American Institutes for Research® | All rights reserved."]
[]
[]
[]
[]
[null,"ABOUT THE NATIONAL HIGH SCHOOL CENTER"]
[null,"The Early Warning System (EWS) Middle Grades Tool is offered by the National High School Center, a central source of information and expertise on high school improvement issues that does not endorse any interventions or conduct field studies. Funded by the U.S. Department of Education, the National High School Center serves the Regional Comprehensive Centers in their work to build the capacity of states across the nation to effectively implement the goals of the Elementary and Secondary Education Act relating to high schools. "]
[]
[]
[]
[null,"The National High School Center is housed at the American Institutes for Research (AIR). The contents of this Tool and guide were developed under a grant from the U.S. Department of Education. However, these contents do not necessarily represent the policy of the U.S. Department of Education, and you should not assume endorsement by the federal government."]
[]
[]
[]
[null,"PR/Award # S283B050028"]
[null,"Funding Agency: U.S. Department of Education"]
[]
[null,"DISCLAIMER"]
[null,"The National High School Center at the American Institutes for Research, along with the software developer, Matrix Knowledge Group, have taken reasonable professional care in the preparation of the EWS Middle Grades Tool and related documentation. Although the National High School Center has made reasonable efforts to develop a tool that provides educators with a means to identify students who are at risk for dropping out, we can neither guarantee absolute accuracy of analysis or predictive power of the identification nor accept responsibility for recommendations that are made on the basis of the outputs. The National High School Center offers this tool with the expectation that all users will adhere to federal, state, and local regulations regarding data privacy. The National High School Center cannot be held liable for misuse of student-level data or the tool itself by users. "]

{"sheet":"menu","index":1,"n_rows":7,"n_cols":15,"rows_kept":7,"cut":false,"hidden":false,"merged":[[6,8,6,10],[6,2,6,4],[1,1,3,17]]}
[]
[null,"EWS MG Tool"]
[]
[]
[]
[]
[null,null,"Tool Setup",null,null,null,null,null,"Data Inputs",null,null,null,null,null,"Outputs & Reports"]

{"sheet":"Help text","index":2,"n_rows":74,"n_cols":6,"rows_kept":74,"cut":false,"hidden":false,"merged":[[3,1,4,3]]}
[]
[]
[]
[null,"Help Text Editor"]
[]
[]
[null,null,true]
[]
[]
[null,"The color of this cell is used as the background for the help pop-ups"]
[null,null,"Width","Height","Left","Top"]
[null,"Main Menu"]
[null,"Tool Setup buttons access three pages: \n\n(1) The “School Information” page is where you enter school details (name, address) and information about members of the school’s EWS team. \n\n(2) The “Tool Settings” page is where you enter information that allows you to customize the tool to fit the school context. \n\n(3) The “Intervention Settings” page is where you enter or import a list of dropout prevention (and related) intervention programs available in the school or district.\n\nClick “More Info” again to close this window.\n\n",325,140]
[null,"Data Inputs buttons access three pages that allow you to import or enter student-level information: \n\n(1) “Student Information” includes names, IDs, demographics, enrollment status, and other information. \n\n(2) “Student Incoming Risk Status” includes information about performance during the prior year (if available). \n\n(3) “Student Exam Risk Status” includes information about an incoming indicator of risk based on exam performance and exam data (if available). \n\n(3) “Student Performance” includes information about attendance and academic performance during each grading period of the academic year. It also allows you to include information about behavior (suspensions and referrals) if you choose to set the thresholds on the “Tool Settings” page.\n\nClick “More Info” again to close this window.\n\n",350,200]
[null,"Outputs and Reports buttons access three types of pages: \n\n(1) “Student Risk Status” provides a list of all students and indicates whether they are identified as being at risk for dropping out, for each indicator. \n\n(2) “Assign Intervention to Student” pages enable you to document the assignment of students to intervention programs and to track their progress in those interventions. \n\n(3) The “Reports Control Panel” provides multiple reporting features to allow you to produce a number of different school- and student-level reports.\n\nClick “More Info” again to close this window.\n\n",325,140]
[null,"Help - Assign Intervention to Student\n\n",325,200]
[]
[null,"Help Text"]
[null,"Help - Help Text Editor\n\nThis page contains all of the text used in the help pop-ups. The text can be edited, although no text formats (e.g., bold or italics) can be used. To insert new lines, you can use ALT+Enter while typing.\n\nThe width and height values can be adjusted as necessary if the text is edited to an extent whereby it no longer fits inside the pop-up.\n",325,100]
[]
[null,"School Information"]
[null,"The “School Information” page allows you to enter school information and contact information for individuals who work on the school-based EWS team. \n\nThe “School Information” page also allows you to upload a logo. The tool’s reports will then include your logo at the top right of each page, customizing the look of the reports for your school. To upload a logo, click the “Upload School/District Logo” button. After clicking the button, simply locate the file (i.e., a picture file such as .gif or .jpeg) that you want to insert and click “Select.” It may take a few minutes to upload the logo image. After it is uploaded, the logo will not be seen on this page, but it will appear on all printed reports. To preview the logo on a report, open a “Print Preview” of any of the reports in the tool.\n\nHINT: Although filling in school information is not required for the tool to work, it does enable the EWS Middle Grades Tool to create more customized reports. In addition, including this information enables a district to review reports from multiple schools (e.g., by a combined school- and district-level team).\n\nClick “More Info” again to close this window.\n\n",325,185]
[]
[null,"Tool Settings"]
[null,"To customize the tool settings and functions to match the local context, set the following options on this page:\n\nGrading periods (GPs): Indicate the number of grading periods used. Enter the total number of days in each grading period and the start and end dates for each grading period. The accuracy of this information is critical to the proper operation of the tool, especially for the calculation of student attendance indicators.\n\nDisability, Race/Ethnicity, Disadvantaged, and ELL Status: These fields are automatically populated with default settings, but they may be changed to match the school’s own categories in each of these areas.\n \nCAUTION: It is important not to add “no” as a category to the disability, race/ethnicity, disadvantaged, and ELL status fields. The EWS Middle Grades Tool assumes that no data in these fields represents the absence of the characteristic (e.g., not ELL or not disadvantaged).\n\nInitial Attendance Time Period: From the pull-down menu, select either a 20-day or 30-day initial time period to first enter and report on student attendance data. \n\nRisk Indicator Thresholds: The tool uses data on student absences, course performance, and behavior (if used), and it flags students as “at risk” if they exceed the indicator threshold on any one or more indicators. The tool includes default risk indicator thresholds that are automatically populated, but it also gives you the option to customize thresholds when appropriate. The behavior indicator threshold must be set for this to work. There is no default behavior threshold; this must be locally validated.\n\nClick “More Info” again to close this window.",325,275,500]
[null,"The tool assesses student risk status by using a variety of research-based indicators applied at various times throughout the school year:\n\n(1) Absences for the first 20 or 30 days of school \n\n(2) Absences and course performance in English language arts and mathematics, and behavior (if applicable) after each grading period \n\nCustomizing the Risk Indicator Thresholds: You are encouraged to use the default risk indicator thresholds for attendance and course performance because they are based on sound research. However, the thresholds are customizable for users who know that alternate thresholds are more predictive for their school or district. To change the risk indicator thresholds, simply type the preferred thresholds into the “Custom” column, and the new thresholds will automatically overwrite the default thresholds. In the case of the behavior thresholds, this must be locally validated, and thresholds must be set by the user. It is possible to use the tool without setting behavior risk thresholds.\n\nClick “More Info” again to close this window.\n\n\n",325,180,500]
[null,"The “Cohort” setting allows you to create up to 10 customizable cohorts into which students can be grouped.\n\nClick “More Info” again to close this window.\n",325,50,500,175]
[]
[null,"Intervention Settings"]
[null,"The “Intervention Settings” page allows you to catalog up to 30 different dropout prevention (or related) interventions that are available to students. You can import or enter each unique intervention name for each program that will be included in the tool. In addition, you can identify interventions by type (attendance, behavior, or academic) and tier (I, II, or III).  \n\nCategorizing interventions by type and tier is not required for the tool to work, but when they are used, you will be able to access additional school- and student-level intervention reports. You also can include a description for each intervention, although it is not required. Intervention names must be listed on this page in order to assign interventions to students in the tool on the ”Student Interventions” page. \n\nIntervention settings may be imported using the ”Import data” button. \n\nClick “More Info” again to close this window.\n\n",325,150]
[]
[null,"Student Information"]
[null,"The “Student Information” page houses information about each student. Each row represents a single student. A unique student ID and the enrollment status field must be entered for each student for the tool to work. Although other fields are not required, entering additional information will give you additional reporting options.\n\nIt is recommended that student data be imported from a data file (i.e., .csv or .txt file).  \n \nIn the ”Enrollment Status” field on the “Student Information” page, you must define students as enrolled, transferred out, transferred in, or dropped out in order for students to be counted by the tool. \n\nEnrolled: Students who are enrolled at the beginning of the year must be identified as “enrolled.” For enrolled students, the “Date of Status Change” and the number of days enrolled for each grading period (next to ”Date of Status Change”) fields can be left blank.\n\nTransferred Out, Transferred In, or Dropped Out: Changes in student enrollment status can be either imported or manually entered in the EWS Middle Grades Tool. For these students, enter the date of the status change and the number of days the student was enrolled for each grading period. Note that students who transfer in should be identified as “transferred in” and not as enrolled.” \n\nDate of Status Change: For students who drop out, or transfer out, enter the date that the students left the school. For students who transfer in, enter the date that the students enrolled in the school.\n\nDays for Each Grading Period: Manually enter the number of days per grading period that the student was enrolled. Be sure to enter data for each grading period, including when the student was not enrolled (0 days), was enrolled for part of the grading period (number of days enrolled during that grading period), and was enrolled for a whole grading period (this number should match the total number of grading period days entered on the “Tool Setting” page for that grading period). \n\nUse the “View” drop-down menu on the top left of this page to display all the student information or only the information related to demographics, contact information, or enrollment status. \n\nNOTE: Students who are marked in the enrollment status column as dropped out or transferred out will have their name and row of data grayed-out on other pages in the tool.\n\nCAUTION: If enrollment status, date of status change, and days enrolled during each grading period are not accurately entered for part-year students, the reports may include miscalculations. Days enrolled need to be manually entered only for part-year students. \n\nClick “More Info” again to close this window.\n\n",550,335]
[]
[null,"Incoming Risk Status"]
[null,"The “Student Incoming Risk Status” page allows you to record in the tool the pre-middle-grades risk status information for each incoming student. Student names and IDs are automatically populated, followed by a column labeled “Flag for Incoming Indicator of Risk” and four other customizable fields. The data in the “Flag for Incoming Indicator of Risk” column indicate whether students were identified before entering the middle grades as being at risk for dropping out. This indicator is identified simply as either “Yes” (at risk) or “No” (not at risk). Blank cells (i.e., missing information) will not cause a problem for the tool, but additional categories or the use of variations such as Y or N will be misread, causing students to be incorrectly flagged for pre-middle-grades risk.\n\nYou can enter these data manually or use the “Import data” button. Further details about importing data can be found in on our website: http://www.betterhighschools.org/ews. \n\nWhen entering or importing student pre-middle-grades risk status data after the start of the year, be sure to first enter any new students who have recently transferred to the school into the “Student Information” page. Student pre-middle-grades risk status data cannot be entered or imported until the new students’ IDs are included on the “Student Information” page. \n\nNot every school will have pre-middle-grades risk status information available, and populating this page is optional. Omitting pre-middle-grades data for any or all students will not affect the ability to identify students who are at risk, but when these data are included in the tool, you will be able to access additional reports.\n\nYou are free to use the “Other” fields on the “Student Incoming Risk Status” page as you wish. You can rename these field headings manually by double-clicking the cell and then typing the new heading.\n\nClick “More Info” again to close this window.\n\n",400,250]
[]
[null,"Student Exam Performance Status"]
[null,"The Student Exam Performance Status page allows you to record data from state and/or district assessments. The exam information may be rolled up to a single indicator of risk (“Yes” for at risk and “No” for not at risk). This page is useful as a reference for EWS teams to obtain information on students’ exam performance. Omitting student exam performance data for any or all students will not affect the ability to identify students who are at risk, but when these data are included in the tool, you will be able to access additional reports.\n\nClick “More Info” again to close this window.\n\n",400,100]
[]
[null,"Indicators"]
[null,"The “Student Risk Status” page requires no data entry. It automatically displays students and their risk status for each indicator per grading period based on information from the “Student Performance” page. \n\nAt each grading period, students can potentially be flagged for attendance, English course failure, math course failure, or behavior (if you choose to set behavior thresholds). At the end of the year, end-of-year totals include flags for annual attendance, English course failure, math course failure, and behavior. For each individual risk indicator, a “Yes” signals that the student is flagged because he or she has exceeded the risk threshold for that indicator. A “No” means that the student is not flagged for that indicator.  \n\nStudents who have one or more “Yes” flags for risk indicators during any grading period or at the end of the year will have their names and student IDs highlighted in red. \n\nStudents who have dropped out or transferred out of the school are grayed-out. \n\nYou can set the time frame to examine students’ risk status by selecting the “Grading Period” or “End-of-Year” option in the “Time frame” drop-down box. In addition, you can choose to show all students or to filter the list on the basis of demographics or cohort by using the “Filter by Demographics” or “Filter by Cohort” drop-down box. \n\nNOTE:  When using the Exit Indicator Export function, each filter option (Demographic, Cohort, and Time Frame) must be set to \"ALL\" otherwise this feature will not export all necessary information.\n\nHINT: To ‘refresh’ this page to reflect updates in performance data entered or imported, choose a different “Filter by Demographics” and “Time frame” selection, and then reselect your selections of interest.\n\nFrom this page, you also can assign interventions to individual students in either of two ways:\n\n(1) Right-click a student’s name and select “Assign to Intervention” at the bottom of the menu.\n\n(2) Click the “Interventions” button at the top of the page to open the “Student Interventions” page.\n\nClick “More Info” again to close this window.\n\n",550,300]
[]
[null,"Student Performance"]
[null,"The “Student Performance” page allows you to record student attendance, course performance, and behavior data that the tool will use to calculate students’ risk status. Student names, IDs, and incoming indicators and exam indicators of risk are automatically populated. You can enter student performance data for each grading period by using the “Import data” button. \n\nCAUTION: When importing student performance data, be sure to enter any new students who have recently transferred to the school into the “Student Information” page. If student performance data include any student IDs that are not already in the “Student Information” page, the “Student Performance” page will not import those students’ data. \n\nHINT: If the school records course grades each semester, you still are advised to look at student risk status based on attendance on a quarterly basis. Simply set the tool on a quarter system (on the “Tool Settings” page), upload or enter data for attendance for ALL four grading periods, and upload or enter data for math and English courses failed only for the second and fourth grading periods.\n\nYear-to-date data totals and averages for each student are automatically calculated in the far-right columns. When the date has passed the LAST day of the final grading period (as set on the “Tool Settings” page), the tool will calculate “End-of-Year” totals and averages by using the simple sum or average of the per-grading-period information.\n\nClick “More Info” again to close this window.\n\n",350,230]
[]
[null,"Student Interventions"]
[null,"The “Student Interventions” page allows you to document the assignment of students to one or more interventions. \n\nTo view assigned interventions for all students, delete the student ID shown in the “Student ID” field (so that the field is blank). To view an individual student’s record, enter his or her student ID in the “Student ID” field. \n\nTo assign a student to an intervention from the “Student Interventions” page, follow these steps:\n\n(1) Enter a student ID to pull up the individual record. If the student ID is not in the file, an error message will appear.\n \n(2) Click the “Assign Intervention to Student” button. A new row will be inserted into the table. The student’s ID, first name, and last name will be automatically populated. If no interventions are entered in the “Intervention Settings” page, an error message will appear.\n\n(3) Select an intervention name from the drop-down list under the column labeled “Intervention.” \n\n(4) Enter the date the student is assigned to begin participating in the intervention. (If the start date of the intervention occurs prior to the start of the first grading period, the tool will identify it as a pre-middle-grades intervention.) \n\n(5) Enter the date when the student is scheduled to stop participating in the intervention. (If the end date of the intervention is blank, the tool will assume that the intervention is ongoing.) \n\nEnter any additional comments as desired. (Entering comments is optional.) For the “Student Intervention” feature to function, intervention start dates are required. \n\nClick “More Info” again to close this window.\n\n",600,240]
[]
[null,"Detailed Student Report"]
[null,"The detailed student report shows information about an individual student. To create a detailed student report, click the “Create Report” button to the right of “Detailed Student Report” on the “Reports Control Panel” page; search for a student by entering a first name, a last name, or a student ID in the search parameters fields; and press ”Enter” on your keyboard. \n\nAfter the search parameters have identified a student, information for that student will be displayed, including demographics, enrollment information, risk indicator flags, assigned interventions, and any comments that were entered on the “Student Information” page. \n\nHINT: This report is meant to identify one student at a time. When you search by name, if more than one student is found with the same first or last name, the report will indicate that additional search parameters need to be used.\n\nClick “More Info” again to close this window.\n\n",325,200]
[]
[null,"Reports Control Panel"]
[null,"The “Reports Control Panel” page enables you to create various reports based on the data that have been entered into the tool. \n\nFour different types of reports are available:\n\n(1) School-Level Reports are graphical reports that show trends in student risk status across the school.\n\n(2) Student-Level Reports show lists of students, grouped by indicators of risk and/or assigned intervention programs, and include summary information. \n\n(3) Detailed Student Report is a simple report that can be generated for each individual student and shows student information, indicators of risk status, and any assigned interventions. \n\n(4) Student-Level Intervention Summary Report is a list of all students, their indicators of risk (flagged or not flagged), and the number and types of interventions assigned to each student.\n\nTo create a school- or student-level report, simply select one from the drop-down lists, select a time frame and/or intervention name (if available), and click the associated “Create Report” button. For some student-level reports, there is no applicable time frame and/or intervention option, in which case the drop-down selection boxes will be grayed-out and disabled. \n\nAll reports are formatted for printing, and printouts will be branded with the school/district logo if you have uploaded it on the “School Information” page. \n\nNOTE: The “Advanced Settings” have been disabled on the EWS Middle Grades Tool. \n\nClick “More Info” again to close this window.\n\n",350,300,450,250]
[]
[null,"Preset Filters"]
[null,"For more information about preset filters, e-mail ews@betterhighschools.org. \n\nClick “More Info” again to close this window.\n\n",325,200]
[]
[null,"High Level Intervention Summary"]
[null,"The student-level intervention summary report shows all students, their indicators of risk (flagged or not flagged), and the number of interventions of each type (attendance, behavior, or academic) assigned to each student during a selected grading period. (The “View” drop-down menu provides options to display information for each grading period or end of year.) \n\nEnd-of-year data show the total number of interventions assigned to each student over the course of the year. In the “End of Year” view, if a single intervention was assigned to a student over multiple grading periods, that program will be counted only once in the totals.\n\nClick “More Info” again to close this window.\n\n",300,150]
[]
[null,"Student Level Reports"]
[null,"Student-level reports list students by indicators of risk and/or assigned intervention programs. These reports can help you identify individual students who are at risk of dropping out and consider their needs for support and intervention. Both predefined and custom student-level reports are available. \n\nStudent-level reports are presented as a table, with each row representing an individual student. The drop-down menus at the top of each report can be used to redefine or filter the information shown, such as specifying a different time frame or intervention program. If a drop-down menu is grayed-out, the option is not available for that report.\n\nSome student-level reports include a summary table on the top right showing data such as the total number of students and the percentage of students who are flagged. Also, the numbers directly above the columns within the reports provide a count of the number of students in that column who are flagged.\n\nGENERAL NOTES:  \n\n(1) The total number of students is calculated using the student enrollment status entered in the “Student Information” page.  \n\n(2) Custom student-level reports can be created by specifying a time frame and any desired data fields for inclusion. \n\nREPORT-SPECIFIC NOTES:\n\nFor the ”Off- to On-Track Report”:\nWhen the “End of Year” time frame is selected, the report shows students who ARE NOT flagged for any end-of-year indicators of risk but who WERE flagged for any indicators of risk in the final grading period of the year. When the “Full Year” time frame is selected, the report shows students who ARE NOT flagged for any end-of-year indicators of risk but who WERE flagged for the pre-middle-grades indicator of risk and/or any indicators of risk during the school year.\n\nFor the “On- to Off-Track Report”:\nWhen the “End of Year” time frame is selected, the report shows students who ARE flagged for any end-of-year indicators of risk but who WERE NOT flagged for any indicators of risk in the final grading period. When the “Full Year” time frame is selected, the report shows students who ARE flagged for any end-of-year indicators of risk but WERE NOT flagged for any indicators of risk during the first grading period.\n\nClick “More Info” again to close this window.\n\n",475,350,650]
[]
[null,"School Level Reports"]
[null,"NOTE:  Enrollment status is based on students’ current enrollment status from the Student Information page and does not change to reflect students’ enrollment status during any particular time frame.\n\nClick ‘More Info’ again to close this window.\n",250,125]
[null,"For more information about the reports, e-mail ews@betterhighschools.org. \n\nClick “More Info” again to close this window.\n\n",250,100]
[null,"NOTE: The top graph is based on current student enrollment statuses from the “Student Information” page and does not change to reflect enrollment statuses during any particular time frame. Therefore, the summary table may show more students with pre-middle-grades data than the number of students who are enrolled in the school.\n\nFor more information about the reports, e-mail ews@betterhighschools.org. \n\nClick “More Info” again to close this window.\n\n",250,125]
[null,"NOTE: Use the “Characteristic” drop-down menu to show results for all students or for subgroups of students. Use the “Intervention” drop-down menu to select and change the intervention program shown.\n\nClick “More Info” again to close this window.\n",250,125]
[null,"For more information about the reports, e-mail ews@betterhighschools.org. \n\nClick “More Info” again to close this window.\n\n",250,100]
[null,"For more information about the reports, e-mail ews@betterhighschools.org. \n\nClick “More Info” again to close this window.\n\n",250,100]
[null,"For more information about the reports, e-mail ews@betterhighschools.org. \n\nClick “More Info” again to close this window.\n\n",250,100]
[null,"For more information about the reports, e-mail ews@betterhighschools.org. \n\nClick “More Info” again to close this window.\n\n",250,100]
[null,"For more information about the reports, e-mail ews@betterhighschools.org. \n\nClick “More Info” again to close this window.\n\n",250,100]

{"sheet":"i_SchoolInfo","index":3,"n_rows":39,"n_cols":5,"rows_kept":39,"cut":false,"hidden":false,"merged":[[1,1,1,4],[22,2,22,3],[11,2,11,3],[14,2,14,3],[15,2,15,3],[2,1,2,3],[3,1,4,4],[12,2,12,3]]}
[]
[null,"Tool Setup 1/3"]
[]
[null,"School Information"]
[]
[]
[]
[]
[null,"School Details"]
[]
[null,"School ID:"]
[null,"School Name:"]
[null,"District Name:"]
[]
[null,"Address Line 1:"]
[null,"Address Line 2:"]
[null,"City:"]
[null,"State:"]
[null,"Zip Code:"]
[]
[null,"Phone:"]
[null,"Fax:"]
[null,"Web Site:"]
[]
[null,"EWS Team Details"]
[]
[null,"Name","Role","Phone","Email"]
["*"]
[]
[]
[]
[]
[]
[]
[]
[]
[]
[]
[null,"* main contact"]

{"sheet":"i_Settings","index":4,"n_rows":38,"n_cols":18,"rows_kept":38,"cut":false,"hidden":false,"merged":[[31,6,31,8],[34,13,34,15],[35,13,36,13],[35,14,36,15],[36,2,36,3],[32,2,32,3],[33,2,33,3],[34,2,34,3],[31,2,31,3],[35,7,36,8],[35,2,35,3],[28,2,28,3],[29,2,29,3],[30,2,30,3],[28,6,28,8],[29,6,29,8],[30,6,30,8],[1,1,1,8],[3,1,4,8],[10,6,10,8],[20,2,20,3],[21,2,21,3],[16,2,16,3],[17,2,17,3],[18,2,18,3],[19,2,19,3],[26,2,26,3],[27,2,27,3],[37,13,39,15],[2,1,2,8],[22,6,23,8],[33,6,33,8],[24,6,24,8],[25,6,25,8],[26,6,26,8],[27,6,27,8],[32,6,32,8],[25,2,25,3],[22,2,22,3],[23,2,23,3],[24,2,24,3],[35,6,36,6]]}
[]
[null,"Tool Setup 2/3"]
[]
[null,"Tool Settings"]
[]
[]
[]
[null,null,null,null,null,null,null,null,null,null,null,null,null,null,"!! Do not remove !!","!! Do not remove !!"]
[null,"Grading Periods (GPs):",1,null,null,null,"Initial Attendance Time Period:",1,null,null,null,null,null,"StudentInfo","Quarters (4 GPs)",20,{"$f":"OFFSET($P$8,$H$9,0)","v":20},"Quarter"]
[{"$f":"A9+1","v":1},null,null,null,null,null,null,null,null,null,null,null,null,null,"Trimesters (3 GPs)",30,{"$f":"COUNTA($B$18:$B$32)","v":13},"Trimester"]
[{"$f":"A10+1","v":2},"Period","Days","Start of Period (mm/dd/yyyy)","End of Period (mm/dd/yyyy)",null,"Risk Indicator Thresholds",null,null,null,null,null,null,null,"Semesters (2 GPs)",null,{"$f":"COUNTA($C$18:$C$32)","v":5},"Semester"]
[{"$f":"A11+1","v":3},{"$f":"IF($C$9=1,\"Quarter \"&$A10,IF($C$9=2,IF($A10<4,\"Trimester \"&$A10,\"\"),IF($A10<3,\"Semester \"&$A10,\"\")))","v":"Quarter 1"},null,null,null,null,"Indicator","Default","Custom",null,null,null,null,null,null,null,{"$f":"COUNTA($E$18:$E$24)","v":1}]
[{"$f":"A12+1","v":4},{"$f":"IF($C$9=1,\"Quarter \"&$A11,IF($C$9=2,IF($A11<4,\"Trimester \"&$A11,\"\"),IF($A11<3,\"Semester \"&$A11,\"\")))","v":"Quarter 2"},null,null,null,null,{"$f":"\"First \"&EarlyAtt&\" day absence rate\"","v":"First 20 day absence rate"},0.2,null,null,null,null,null,null,null,{"$f":"IF(I13<>\"\",I13,H13)","v":0.2},{"$f":"COUNTA($E$28:$E$32)","v":1}]
[null,{"$f":"IF($C$9=1,\"Quarter \"&$A12,IF($C$9=2,IF($A12<4,\"Trimester \"&$A12,\"\"),IF($A12<3,\"Semester \"&$A12,\"\")))","v":"Quarter 3"},null,null,null,null,"Grading period absence rate",0.2,null,null,null,null,null,null,null,{"$f":"IF(I14<>\"\",I14,H14)","v":0.2},{"$f":"COUNTA($G$25:$I$34)","v":3}]
[null,{"$f":"IF($C$9=1,\"Quarter \"&$A13,IF($C$9=2,IF($A13<4,\"Trimester \"&$A13,\"\"),IF($A13<3,\"Semester \"&$A13,\"\")))","v":"Quarter 4"},null,null,null,null,"Annual absence rate",0.2,null,null,null,null,null,null,null,0.2]
[null,null,null,null,null,null,"English course failed (per grading period)",1,null,null,null,null,null,null,null,1]
[null,"Disabilities","Race/Ethnicities",null,"ELL Status",null,"English course failed (annual)",{"$f":"5-GP_Type","v":4},null,null,null,null,null,null,null,4]
[null,"Autism","American Indian or Alaskan Native",null,"Yes",null,"Math course failed (per grading period)",1,null,null,null,null,null,null,null,1]
[null,"Deaf-blindness","Asian or Pacific Islander",null,null,null,"Math course failed (annual)",{"$f":"5-GP_Type","v":4},null,null,null,null,null,null,null,4]
[null,"Emotional disturbance","Black, Not Hispanic",null,null,null,"Behavior (grading period)",null,null,null,null,null,null,null,null,0]
[null,"Hearing impairment (including deafness)","Hispanic",null,null,null,"Behavior (annual)",null,null,null,null,null,null,null,null,0]
[null,"Mental retardation","White, Not Hispanic"]
[null,"Multiple disabilities",null,null,null,null,"Cohort (Custom Grouping Variable)"]
[null,"Orthopedic impairment"]
[null,"Other health impairment",null,null,null,null,"Cohort A"]
[null,"Specific learning disability",null,null,null,null,"Cohort B"]
[null,"Speech or language impairment",null,null,"Disadv. Status",null,"Cohort C"]
[null,"Traumatic brain injury",null,null,"Yes"]
[null,"Visual impairment (including blindness)"]
[null,"Learning disability"]
[]
[]
[]
[]
[null,null,null,null,null,null,null,null,null,null,null,null,null,{"$f":"\"Advanced Settings (\"&FilterLockStatus&\")\"","v":"Advanced Settings (LOCKED)"}]
[null,null,null,null,null,null,"Kindergarten Cut Off Date (mm/dd)"]
[]
[null,null,null,null,null,null,null,null,null,null,null,null,null,"To enable the advanced filter settings in the reports control panel, please enter the password in the space above and click the 'Unlock' button."]

{"sheet":"i_IntDesc","index":5,"n_rows":14,"n_cols":7,"rows_kept":14,"cut":false,"hidden":false,"merged":[[3,1,4,4],[1,1,1,4]]}
[]
[null,"Tool Setup 3/3"]
[]
[null,"Intervention Settings"]
[]
[]
[]
[]
[null,"Total Interventions:",{"$f":"COUNTA(B12:B41)","v":0}]
[]
[null,"Intervention Name","Type","Tier","Description","Type","Tier"]
[null,null,null,null,null,"Attendance","I"]
[null,null,null,null,null,"Behavior","II"]
[null,null,null,null,null,"Academic","III"]

{"sheet":"i_StudentInfo","index":6,"n_rows":73,"n_cols":31,"rows_kept":73,"cut":false,"hidden":false,"merged":[[1,1,1,3],[10,21,11,21],[10,12,11,17],[10,18,11,20],[10,4,11,10],[10,1,11,3],[3,1,4,3],[10,11,11,11]]}
[]
[null,"Data Input 1/4"]
[]
[null,"Student Information"]
[]
[]
[]
[]
[null,"View",1]
[]
[null,"Student Details",null,null,"Student Demographics",null,null,null,null,null,null,"Grouping Variable","Enrollment Status",null,null,null,null,null,"Contact Information",null,null,"Comments"]
[null,null,null,null,null,null,null,null,null,null,null,null,null,null,null,null,null,null,null,null,null,null,null,null,null,null,null,null,"Disadvantaged","Enrollment status","Views"]
[null,"First Name","Last Name","Student ID","Grade","DOB (mm/dd/yyyy)","Gender","Race/Ethnicity","Disability","Disadvantaged","ELL Status","Cohort","Enrollment Status","Date of Status Change",{"$f":"INDEX(i_Settings!$R$9:$R$11,GP_Type)&\" 1 Days\"","v":"Quarter 1 Days"},{"$f":"INDEX(i_Settings!$R$9:$R$11,GP_Type)&\" 2 Days\"","v":"Quarter 2 Days"},{"$f":"INDEX(i_Settings!$R$9:$R$11,GP_Type)&\" 3 Days\"","v":"Quarter 3 Days"},{"$f":"INDEX(i_Settings!$R$9:$R$11,GP_Type)&\" 4 Days\"","v":"Quarter 4 Days"},"Guardian(s)","Phone","Email","Comments",null,"Student ID","Lookup","Students",null,null,"Yes","Enrolled","All"]
[null,null,null,null,null,null,null,null,null,null,null,null,null,null,null,null,null,null,null,null,null,null,null,{"$f":"D14","v":0},{"$f":"IF(SrchID=\"\",\"\",D14)&IF(SrchFName=\"\",\"\",C14)&IF(SrchLName=\"\",\"\",B14)","v":""},{"$f":"COUNTA(D:D)-1","v":0},null,null,"No","Transferred Out","Student demographics"]
[null,null,null,null,null,null,null,null,null,null,null,null,null,null,null,null,null,null,null,null,null,null,null,{"$f":"D15","v":0},{"$f":"IF(SrchID=\"\",\"\",D15)&IF(SrchFName=\"\",\"\",C15)&IF(SrchLName=\"\",\"\",B15)","v":""},{"$f":"COUNTA(D:D)-1-COUNTIF(O:O,0)","v":0},null,null,null,"Transferred In","Cohorts"]
[null,null,null,null,null,null,null,null,null,null,null,null,null,null,null,null,null,null,null,null,null,null,null,0,"",{"$f":"COUNTA(D:D)-1-COUNTIF(P:P,0)","v":0},null,null,null,"Dropped Out","Enrollment status"]
[null,null,null,null,null,null,null,null,null,null,null,null,null,null,null,null,null,null,null,null,null,null,null,0,"",{"$f":"COUNTA(D:D)-1-COUNTIF(Q:Q,0)","v":0},null,null,null,null,"Contact information"]
[null,null,null,null,null,null,null,null,null,null,null,null,null,null,null,null,null,null,null,null,null,null,null,0,"",{"$f":"COUNTA(D:D)-1-COUNTIF(R:R,0)","v":0},null,null,null,null,"Comments"]
[null,null,null,null,null,null,null,null,null,null,null,null,null,null,null,null,null,null,null,null,null,null,null,0,""]
[null,null,null,null,null,null,null,null,null,null,null,null,null,null,null,null,null,null,null,null,null,null,null,0,""]
[null,null,null,null,null,null,null,null,null,null,null,null,null,null,null,null,null,null,null,null,null,null,null,0,""]
[null,null,null,null,null,null,null,null,null,null,null,null,null,null,null,null,null,null,null,null,null,null,null,0,""]
[null,null,null,null,null,null,null,null,null,null,null,null,null,null,null,null,null,null,null,null,null,null,null,0,""]
[null,null,null,null,null,null,null,null,null,null,null,null,null,null,null,null,null,null,null,null,null,null,null,0,""]
[null,null,null,null,null,null,null,null,null,null,null,null,null,null,null,null,null,null,null,null,null,null,null,0,""]
[null,null,null,null,null,null,null,null,null,null,null,null,null,null,null,null,null,null,null,null,null,null,null,0,""]
[null,null,null,null,null,null,null,null,null,null,null,null,null,null,null,null,null,null,null,null,null,null,null,0,""]
[null,null,null,null,null,null,null,null,null,null,null,null,null,null,null,null,null,null,null,null,null,null,null,0,""]
[null,null,null,null,null,null,null,null,null,null,null,null,null,null,null,null,null,null,null,null,null,null,null,0,""]
[null,null,null,null,null,null,null,null,null,null,null,null,null,null,null,null,null,null,null,null,null,null,null,0,""]
[null,null,null,null,null,null,null,null,null,null,null,null,null,null,null,null,null,null,null,null,null,null,null,0,""]
[null,null,null,null,null,null,null,null,null,null,null,null,null,null,null,null,null,null,null,null,null,null,null,0,""]
[null,null,null,null,null,null,null,null,null,null,null,null,null,null,null,null,null,null,null,null,null,null,null,0,""]
[null,null,null,null,null,null,null,null,null,null,null,null,null,null,null,null,null,null,null,null,null,null,null,0,""]
[null,null,null,null,null,null,null,null,null,null,null,null,null,null,null,null,null,null,null,null,null,null,null,0,""]
[null,null,null,null,null,null,null,null,null,null,null,null,null,null,null,null,null,null,null,null,null,null,null,0,""]
[null,null,null,null,null,null,null,null,null,null,null,null,null,null,null,null,null,null,null,null,null,null,null,0,""]
[null,null,null,null,null,null,null,null,null,null,null,null,null,null,null,null,null,null,null,null,null,null,null,0,""]
[null,null,null,null,null,null,null,null,null,null,null,null,null,null,null,null,null,null,null,null,null,null,null,0,""]
[null,null,null,null,null,null,null,null,null,null,null,null,null,null,null,null,null,null,null,null,null,null,null,0,""]
[null,null,null,null,null,null,null,null,null,null,null,null,null,null,null,null,null,null,null,null,null,null,null,0,""]
[null,null,null,null,null,null,null,null,null,null,null,null,null,null,null,null,null,null,null,null,null,null,null,0,""]
[null,null,null,null,null,null,null,null,null,null,null,null,null,null,null,null,null,null,null,null,null,null,null,0,""]
[null,null,null,null,null,null,null,null,null,null,null,null,null,null,null,null,null,null,null,null,null,null,null,0,""]
[]
[null,null,null,null,null,null,null,null,null,null,null,null,null,null,null,null,null,null,null,null,null,null,null,{"$f":"D46","v":0},{"$f":"IF(SrchID=\"\",\"\",D46)&IF(SrchFName=\"\",\"\",C46)&IF(SrchLName=\"\",\"\",B46)","v":""}]
[null,null,null,null,null,null,null,null,null,null,null,null,null,null,null,null,null,null,null,null,null,null,null,0,""]
[null,null,null,null,null,null,null,null,null,null,null,null,null,null,null,null,null,null,null,null,null,null,null,0,""]
[null,null,null,null,null,null,null,null,null,null,null,null,null,null,null,null,null,null,null,null,null,null,null,0,""]
[null,null,null,null,null,null,null,null,null,null,null,null,null,null,null,null,null,null,null,null,null,null,null,0,""]
[null,null,null,null,null,null,null,null,null,null,null,null,null,null,null,null,null,null,null,null,null,null,null,0,""]
[null,null,null,null,null,null,null,null,null,null,null,null,null,null,null,null,null,null,null,null,null,null,null,0,""]
[null,null,null,null,null,null,null,null,null,null,null,null,null,null,null,null,null,null,null,null,null,null,null,0,""]
[null,null,null,null,null,null,null,null,null,null,null,null,null,null,null,null,null,null,null,null,null,null,null,0,""]
[null,null,null,null,null,null,null,null,null,null,null,null,null,null,null,null,null,null,null,null,null,null,null,0,""]
[null,null,null,null,null,null,null,null,null,null,null,null,null,null,null,null,null,null,null,null,null,null,null,0,""]
[null,null,null,null,null,null,null,null,null,null,null,null,null,null,null,null,null,null,null,null,null,null,null,0,""]
[null,null,null,null,null,null,null,null,null,null,null,null,null,null,null,null,null,null,null,null,null,null,null,0,""]
[null,null,null,null,null,null,null,null,null,null,null,null,null,null,null,null,null,null,null,null,null,null,null,0,""]
[null,null,null,null,null,null,null,null,null,null,null,null,null,null,null,null,null,null,null,null,null,null,null,0,""]
[null,null,null,null,null,null,null,null,null,null,null,null,null,null,null,null,null,null,null,null,null,null,null,0,""]
[null,null,null,null,null,null,null,null,null,null,null,null,null,null,null,null,null,null,null,null,null,null,null,0,""]
[null,null,null,null,null,null,null,null,null,null,null,null,null,null,null,null,null,null,null,null,null,null,null,0,""]
[null,null,null,null,null,null,null,null,null,null,null,null,null,null,null,null,null,null,null,null,null,null,null,{"$f":"D64","v":0},{"$f":"IF(SrchID=\"\",\"\",D64)&IF(SrchFName=\"\",\"\",C64)&IF(SrchLName=\"\",\"\",B64)","v":""}]
[null,null,null,null,null,null,null,null,null,null,null,null,null,null,null,null,null,null,null,null,null,null,null,0,""]
[null,null,null,null,null,null,null,null,null,null,null,null,null,null,null,null,null,null,null,null,null,null,null,0,""]
[null,null,null,null,null,null,null,null,null,null,null,null,null,null,null,null,null,null,null,null,null,null,null,0,""]
[null,null,null,null,null,null,null,null,null,null,null,null,null,null,null,null,null,null,null,null,null,null,null,0,""]
[null,null,null,null,null,null,null,null,null,null,null,null,null,null,null,null,null,null,null,null,null,null,null,0,""]
[null,null,null,null,null,null,null,null,null,null,null,null,null,null,null,null,null,null,null,null,null,null,null,0,""]
[null,null,null,null,null,null,null,null,null,null,null,null,null,null,null,null,null,null,null,null,null,null,null,0,""]
[null,null,null,null,null,null,null,null,null,null,null,null,null,null,null,null,null,null,null,null,null,null,null,{"$f":"D72","v":0},""]
[null,null,null,null,null,null,null,null,null,null,null,null,null,null,null,null,null,null,null,null,null,null,null,{"$f":"D73","v":0},""]

{"sheet":"i_pre-HS","index":7,"n_rows":62,"n_cols":24,"rows_kept":62,"cut":false,"hidden":false,"merged":[[9,4,10,12],[3,1,4,5],[9,1,10,3],[1,1,1,5]]}
[]
[null,"Data Input 2/4"]
[]
[null,"Student Incoming Risk Status"]
[]
[]
[]
[]
[]
[null,"Student Details",null,null,"Incoming Data"]
[]
[null,"Student ID","First Name","Last Name","Flag for Incoming Indicator of Risk","Other1","Other2","Other3","Other4","Other5","Other6","Other7","Other8",null,"Count","Field1","Field2","Field3","Field4","Field5","Field6","Field7","Field8","Field9"]
[{"$f":"B13","v":0},{"$f":"i_StudentInfo!D14","v":0},{"$f":"i_StudentInfo!B14","v":0},{"$f":"i_StudentInfo!C14","v":0},null,null,null,null,null,null,null,null,null,null,{"$f":"COUNTA(B:B)-4","v":1},{"$f":"IF(ISERROR(MATCH($B13,i_RawPreHS!$A:$A,0)),\"\",IF(INDEX(i_RawPreHS!$B:$B,MATCH($B13,i_RawPreHS!$A:$A,0))=\"\",\"\",INDEX(i_RawPreHS!$B:$B,MATCH($B13,i_RawPreHS!$A:$A,0))))","v":""},{"$f":"IF(ISERROR(MATCH($B13,i_RawPreHS!$A:$A,0)),\"\",IF(INDEX(i_RawPreHS!$C:$C,MATCH($B13,i_RawPreHS!$A:$A,0))=\"\",\"\",INDEX(i_RawPreHS!$C:$C,MATCH($B13,i_RawPreHS!$A:$A,0))))","v":""},{"$f":"IF(ISERROR(MATCH($B13,i_RawPreHS!$A:$A,0)),\"\",IF(INDEX(i_RawPreHS!$D:$D,MATCH($B13,i_RawPreHS!$A:$A,0))=\"\",\"\",INDEX(i_RawPreHS!$D:$D,MATCH($B13,i_RawPreHS!$A:$A,0))))","v":""},{"$f":"IF(ISERROR(MATCH($B13,i_RawPreHS!$A:$A,0)),\"\",IF(INDEX(i_RawPreHS!$E:$E,MATCH($B13,i_RawPreHS!$A:$A,0))=\"\",\"\",INDEX(i_RawPreHS!$E:$E,MATCH($B13,i_RawPreHS!$A:$A,0))))","v":""},{"$f":"IF(ISERROR(MATCH($B13,i_RawPreHS!$A:$A,0)),\"\",IF(INDEX(i_RawPreHS!$F:$F,MATCH($B13,i_RawPreHS!$A:$A,0))=\"\",\"\",INDEX(i_RawPreHS!$F:$F,MATCH($B13,i_RawPreHS!$A:$A,0))))","v":""},{"$f":"IF(ISERROR(MATCH($B13,i_RawPreHS!$A:$A,0)),\"\",IF(INDEX(i_RawPreHS!$G:$G,MATCH($B13,i_RawPreHS!$A:$A,0))=\"\",\"\",INDEX(i_RawPreHS!$G:$G,MATCH($B13,i_RawPreHS!$A:$A,0))))","v":""},{"$f":"IF(ISERROR(MATCH($B13,i_RawPreHS!$A:$A,0)),\"\",IF(INDEX(i_RawPreHS!$H:$H,MATCH($B13,i_RawPreHS!$A:$A,0))=\"\",\"\",INDEX(i_RawPreHS!$H:$H,MATCH($B13,i_RawPreHS!$A:$A,0))))","v":""},{"$f":"IF(ISERROR(MATCH($B13,i_RawPreHS!$A:$A,0)),\"\",IF(INDEX(i_RawPreHS!$I:$I,MATCH($B13,i_RawPreHS!$A:$A,0))=\"\",\"\",INDEX(i_RawPreHS!$I:$I,MATCH($B13,i_RawPreHS!$A:$A,0))))","v":""},{"$f":"IF(ISERROR(MATCH($B13,i_RawPreHS!$A:$A,0)),\"\",IF(INDEX(i_RawPreHS!$J:$J,MATCH($B13,i_RawPreHS!$A:$A,0))=\"\",\"\",INDEX(i_RawPreHS!$J:$J,MATCH($B13,i_RawPreHS!$A:$A,0))))","v":""}]
[]
[]
[]
[]
[]
[]
[]
[]
[]
[]
[]
[]
[]
[]
[]
[]
[]
[]
[]
[]
[]
[]
[]
[]
[]
[]
[]
[]
[]
[]
[null,null,null,null,null,"","","",null,null,null,null,""]
[null,null,null,null,null,"","","",null,null,null,null,""]
[null,null,null,null,null,"","","",null,null,null,null,""]
[null,null,null,null,null,"","","",null,null,null,null,""]
[null,null,null,null,null,"","","",null,null,null,null,""]
[null,null,null,null,null,"","","",null,null,null,null,""]
[null,null,null,null,null,"","","",null,null,null,null,""]
[null,null,null,null,null,"","","",null,null,null,null,""]
[null,null,null,null,null,"","","",null,null,null,null,""]
[null,null,null,null,null,"","","",null,null,null,null,""]
[null,null,null,null,null,"","","",null,null,null,null,""]
[null,null,null,null,null,"","","",null,null,null,null,""]
[null,null,null,null,null,"","","",null,null,null,null,""]
[null,null,null,null,null,"","","",null,null,null,null,""]
[null,null,null,null,null,"","","",null,null,null,null,""]
[null,null,null,null,null,"","","",null,null,null,null,""]
[null,null,null,null,null,"","","",null,null,null,null,""]
[null,null,null,null,null,"","","",null,null,null,null,""]
[null,null,null,null,null,"","","",null,null,null,null,""]

{"sheet":"i_RawPreHS","index":8,"n_rows":32,"n_cols":12,"rows_kept":32,"cut":false,"hidden":true,"merged":[]}
["Student ID","Exit Indicator","Semester 2 Flag for Attendance","Semester 2 Flag for English Course Failed","Semester 2 Flag for Math Course Failed","Semester 2 Flag for Behavior","End of Year Flag for Year Attendance","End of Year Flag for English Course Failed","End of Year Flag for Math Course Failed","End of Year Flag for Behavior","First Name","Last Name"]
["01","No","--","--","--","--","--","--","--","--","Christian","Manner"]
["2","Yes","No","Yes","No","--","No","Yes","No","--","Nelson","Linck"]
["3","Yes","No","No","Yes","--","No","No","Yes","--","Lindsay","Catriona"]
["4","Yes","No","Yes","No","--","No","Yes","No","--","Ted","Uy"]
["5","Yes","No","Yes","No","--","No","Yes","No","--","Hugh","Steck"]
["6","No","No","No","No","--","No","No","No","--","Christian","Manner"]
["7","Yes","No","Yes","Yes","--","No","Yes","Yes","--","Nelson","Linck"]
["8","Yes","No","Yes","Yes","--","No","Yes","Yes","--","Kelly","Maddix"]
["9","No","No","No","No","--","No","No","No","--","Ted","Uy"]
["10","No","No","No","No","--","No","No","No","--","Hugh","Steck"]
["11","Yes","No","No","Yes","--","No","No","Yes","--","Christian","Manner"]
["12","No","No","No","No","--","No","No","No","--","Nelson","Linck"]
["13","Yes","No","No","Yes","--","No","No","Yes","--","Kelly","Maddix"]
["14","No","No","No","No","--","No","No","No","--","Ted","Uy"]
["15","Yes","No","Yes","Yes","--","No","Yes","Yes","--","Hugh","Steck"]
["16","No","No","No","No","--","No","No","No","--","Christian","Manner"]
["17","Yes","No","No","Yes","--","No","No","Yes","--","Nelson","Linck"]
["18","Yes","No","Yes","Yes","--","No","Yes","Yes","--","Kelly","Maddix"]
["19","No","No","No","No","--","No","No","No","--","Ted","Uy"]
["20","Yes","No","Yes","No","--","No","Yes","No","--","Hugh","Steck"]
["21","No","No","No","No","--","No","No","No","--","Christian","Manner"]
["22","Yes","No","No","Yes","--","No","No","Yes","--","Nelson","Linck"]
["23","No","No","No","No","--","No","No","No","--","Kelly","Maddix"]
["24","Yes","No","No","Yes","--","No","No","Yes","--","Ted","Uy"]
["25","Yes","No","No","Yes","--","No","No","Yes","--","Hugh","Steck"]
["26","Yes","No","Yes","No","--","No","Yes","No","--","Christian","Manner"]
["27","Yes","No","Yes","No","--","No","Yes","No","--","Nelson","Linck"]
["28","Yes","No","Yes","No","--","No","Yes","No","--","Kelly","Maddix"]
["29","Yes","No","Yes","No","--","No","Yes","No","--","Ted","Uy"]
["30","Yes","No","Yes","No","--","No","Yes","No","--","Hugh","Steck"]
["31","No","--","--","--","--","--","--","--","--","Hugh","Steck"]

{"sheet":"i_exam","index":9,"n_rows":62,"n_cols":16,"rows_kept":62,"cut":false,"hidden":false,"merged":[[1,1,1,5],[3,1,4,5],[9,1,10,3],[9,4,10,8]]}
[]
[null,"Data Input 3/4"]
[]
[null,"Student Exam Performance"]
[]
[]
[]
[]
[]
[null,"Student Details",null,null,"Exam Data"]
[]
[null,"Student ID","First Name","Last Name","Flag for Exam Indicator of Risk","Other1","Other2","Other3","Other4",null,"Count","Field1","Field2","Field3","Field4","Field5"]
[{"$f":"B13","v":0},{"$f":"i_StudentInfo!D14","v":0},{"$f":"i_StudentInfo!B14","v":0},{"$f":"i_StudentInfo!C14","v":0},null,null,null,null,null,null,{"$f":"COUNTA(B:B)-4","v":1},{"$f":"IF(ISERROR(MATCH($B13,i_RawExam!$A:$A,0)),\"\",IF(INDEX(i_RawExam!$B:$B,MATCH($B13,i_RawExam!$A:$A,0))=\"\",\"\",INDEX(i_RawExam!$B:$B,MATCH($B13,i_RawExam!$A:$A,0))))","v":""},{"$f":"IF(ISERROR(MATCH($B13,i_RawExam!$A:$A,0)),\"\",IF(INDEX(i_RawExam!$C:$C,MATCH($B13,i_RawExam!$A:$A,0))=\"\",\"\",INDEX(i_RawExam!$C:$C,MATCH($B13,i_RawExam!$A:$A,0))))","v":""},{"$f":"IF(ISERROR(MATCH($B13,i_RawExam!$A:$A,0)),\"\",IF(INDEX(i_RawExam!$D:$D,MATCH($B13,i_RawExam!$A:$A,0))=\"\",\"\",INDEX(i_RawExam!$D:$D,MATCH($B13,i_RawExam!$A:$A,0))))","v":""},{"$f":"IF(ISERROR(MATCH($B13,i_RawExam!$A:$A,0)),\"\",IF(INDEX(i_RawExam!$E:$E,MATCH($B13,i_RawExam!$A:$A,0))=\"\",\"\",INDEX(i_RawExam!$E:$E,MATCH($B13,i_RawExam!$A:$A,0))))","v":""},{"$f":"IF(ISERROR(MATCH($B13,i_RawExam!$A:$A,0)),\"\",IF(INDEX(i_RawExam!$F:$F,MATCH($B13,i_RawExam!$A:$A,0))=\"\",\"\",INDEX(i_RawExam!$F:$F,MATCH($B13,i_RawExam!$A:$A,0))))","v":""}]
[]
[]
[]
[]
[]
[]
[]
[]
[]
[]
[]
[]
[]
[]
[]
[]
[]
[]
[]
[]
[]
[]
[]
[]
[]
[]
[]
[]
[]
[null,null,null,null,"","","","",""]
[null,null,null,null,null,"","","",""]
[null,null,null,null,null,"","","",""]
[null,null,null,null,null,"","","",""]
[null,null,null,null,null,"","","",""]
[null,null,null,null,null,"","","",""]
[null,null,null,null,null,"","","",""]
[null,null,null,null,null,"","","",""]
[null,null,null,null,null,"","","",""]
[null,null,null,null,null,"","","",""]
[null,null,null,null,null,"","","",""]
[null,null,null,null,null,"","","",""]
[null,null,null,null,null,"","","",""]
[null,null,null,null,null,"","","",""]
[null,null,null,null,null,"","","",""]
[null,null,null,null,null,"","","",""]
[null,null,null,null,null,"","","",""]
[null,null,null,null,null,"","","",""]
[null,null,null,null,null,"","","",""]
[null,null,null,null,null,"","","",""]

{"sheet":"i_RawExam","index":10,"n_rows":30,"n_cols":6,"rows_kept":30,"cut":false,"hidden":true,"merged":[]}
[1,"Yes","test1","test2","test3","test4"]
[2]
[3,"Yes"]
[4,null,"test1","test2","test3","test4"]
[5,"Yes"]
[6,"No"]
[7,"Yes"]
[8,"No"]
[9,"Yes"]
[10,"No","test1","test2","test3","test4"]
[11,"Yes"]
[12,"No","test1","test2","test3","test4"]
[13,"Yes"]
[14,"No","test1","test2","test3","test4"]
[15,"Yes"]
[16,"No"]
[17,"Yes"]
[18,"No"]
[19,"Yes"]
[20,"No"]
[21,"Yes","test1","test2","test3","test4"]
[22,"No","test1","test2","test3","test4"]
[23,"Yes"]
[24,"No"]
[25,"Yes"]
[26,"No"]
[27,"Yes"]
[28,"No","test1","test2","test3","test4"]
[29,"Yes"]
[30,"No"]

{"sheet":"i_PerfData","index":11,"n_rows":18,"n_cols":38,"rows_kept":18,"cut":false,"hidden":false,"merged":[[1,2,1,5],[8,2,8,3],[10,2,11,4],[10,25,11,28],[10,8,11,12],[10,13,11,16],[10,17,11,20],[10,5,11,5],[10,21,11,24],[3,2,4,6],[10,6,11,6],[10,7,11,7]]}
[]
[null,null,"           Data Input 4/4"]
[]
[null,null,"Student Performance"]
[]
[]
[]
[]
[null,null,"View:",null,1]
[]
[null,null,"Student Details",null,null,"Grouping Variable","Incoming","Exam Performance",{"$f":"i_Settings!$B12","v":"Quarter 1"},null,null,null,null,{"$f":"i_Settings!$B13","v":"Quarter 2"},null,null,null,{"$f":"i_Settings!$B14","v":"Quarter 3"},null,null,null,{"$f":"i_Settings!$B15","v":"Quarter 4"},null,null,null,"Year to Date"]
[null,null,null,null,null,null,null,null,null,null,null,null,null,null,null,null,null,null,null,null,null,null,null,null,null,null,null,null,null,null,"When uploading data these formulas get copied into the relevant GP and filled down",null,null,null,null,null,null,"Views"]
[null,null,"Student ID","First Name","Last Name","Cohort","Incoming Risk Status","Exam Performance",{"$f":"\"First \"&EarlyAtt&\" Day Absences\"","v":"First 20 Day Absences"},"Total Absences","English Courses Failed","Math Courses Failed","Behavior","Total Absences","English Courses Failed","Math Courses Failed","Behavior","Total Absences","English Courses Failed","Math Courses Failed","Behavior","Total Absences","English Courses Failed","Math Courses Failed","Behavior","Total Absences","English Courses Failed","Math Courses Failed","Behavior",null,"Field1","Field2","Field3","Field4","Field5","Field6",{"$f":"COUNTA(A:A)","v":1},"All"]
[{"$f":"i_StudentInfo!M14","v":0},null,{"$f":"IF(i_StudentInfo!D14=\"\",\"\",i_StudentInfo!D14)","v":""},{"$f":"IF(i_StudentInfo!B14=\"\",\"\",i_StudentInfo!B14)","v":""},{"$f":"IF(i_StudentInfo!C14=\"\",\"\",i_StudentInfo!C14)","v":""},{"$f":"IF(i_StudentInfo!L14=\"\",\"\",i_StudentInfo!L14)","v":""},{"$f":"IF(OR('i_pre-HS'!E13=0,'i_pre-HS'!E13=\"\"),\"--\",'i_pre-HS'!E13)","v":"--"},{"$f":"IF(OR(i_exam!E13=0,i_exam!E13=\"\"),\"--\",i_exam!E13)","v":"--"},null,null,null,null,null,null,null,null,null,null,null,null,null,null,null,null,null,{"$f":"IF(AND(J14=\"\",StudentPerf2=\"\",StudentPerf3=\"\",StudentPerf4=\"\"),\"--\",SUM(V14,R14,N14,J14))","v":"--"},{"$f":"IF(AND(K14=\"\",O14=\"\",S14=\"\",W14=\"\"),\"--\",SUM(W14,S14,O14,K14))","v":"--"},{"$f":"IF(AND(L14=\"\",P14=\"\",T14=\"\",X14=\"\"),\"--\",SUM(X14,T14,P14,L14))","v":"--"},{"$f":"IF(AND(M14=\"\",Q14=\"\",U14=\"\",Y14=\"\"),\"--\",SUM(Y14,U14,Q14,M14))","v":"--"},null,{"$f":"IF(ISERROR(MATCH($C14,i_RawPerf!$A:$A,0)),\"\",IF(INDEX(i_RawPerf!$B:$B,MATCH($C14,i_RawPerf!$A:$A,0))=\"\",\"\",INDEX(i_RawPerf!$B:$B,MATCH($C14,i_RawPerf!$A:$A,0))))","v":""},{"$f":"IF(ISERROR(MATCH($C14,i_RawPerf!$A:$A,0)),\"\",IF(INDEX(i_RawPerf!$C:$C,MATCH($C14,i_RawPerf!$A:$A,0))=\"\",\"\",INDEX(i_RawPerf!$C:$C,MATCH($C14,i_RawPerf!$A:$A,0))))","v":""},{"$f":"IF(ISERROR(MATCH($C14,i_RawPerf!$A:$A,0)),\"\",IF(INDEX(i_RawPerf!$D:$D,MATCH($C14,i_RawPerf!$A:$A,0))=\"\",\"\",INDEX(i_RawPerf!$D:$D,MATCH($C14,i_RawPerf!$A:$A,0))))","v":""},{"$f":"IF(ISERROR(MATCH($C14,i_RawPerf!$A:$A,0)),\"\",IF(INDEX(i_RawPerf!$E:$E,MATCH($C14,i_RawPerf!$A:$A,0))=\"\",\"\",INDEX(i_RawPerf!$E:$E,MATCH($C14,i_RawPerf!$A:$A,0))))","v":""},{"$f":"IF(ISERROR(MATCH($C14,i_RawPerf!$A:$A,0)),\"\",IF(INDEX(i_RawPerf!$F:$F,MATCH($C14,i_RawPerf!$A:$A,0))=\"\",\"\",INDEX(i_RawPerf!$F:$F,MATCH($C14,i_RawPerf!$A:$A,0))))","v":""},{"$f":"IF(ISERROR(MATCH($C14,i_RawPerf!$A:$A,0)),\"\",IF(INDEX(i_RawPerf!$G:$G,MATCH($C14,i_RawPerf!$A:$A,0))=\"\",\"\",INDEX(i_RawPerf!$G:$G,MATCH($C14,i_RawPerf!$A:$A,0))))","v":""},null,{"$f":"i_Settings!$B12","v":"Quarter 1"}]
[null,null,null,null,null,null,null,null,null,null,null,null,null,null,null,null,null,null,null,null,null,null,null,null,null,null,null,null,null,null,null,null,null,null,null,null,null,{"$f":"i_Settings!$B13","v":"Quarter 2"}]
[null,null,null,null,null,null,null,null,null,null,null,null,null,null,null,null,null,null,null,null,null,null,null,null,null,null,null,null,null,null,null,null,null,null,null,null,null,{"$f":"i_Settings!$B14","v":"Quarter 3"}]
[null,null,null,null,null,null,null,null,null,null,null,null,null,null,null,null,null,null,null,null,null,null,null,null,null,null,null,null,null,null,null,null,null,null,null,null,null,{"$f":"i_Settings!$B15","v":"Quarter 4"}]
[null,null,null,null,null,null,null,null,null,null,null,null,null,null,null,null,null,null,null,null,null,null,null,null,null,null,null,null,null,null,null,null,null,null,null,null,null,"Year to date"]

{"sheet":"i_RawPerf","index":12,"n_rows":30,"n_cols":4,"rows_kept":30,"cut":false,"hidden":true,"merged":[]}
["1",1,1,0]
["2",1,1,0]
["3",3,0,1]
["4",4,1,0]
["5",3,1,0]
["6",2,0,0]
["7",4,1,1]
["8",2,1,1]
["9",5,0,0]
["10",10,1,1]
["11",3,0,1]
["12",5,0,0]
["13",5,0,1]
["14",6,0,0]
["15",4,1,1]
["16",2,0,0]
["17",2,0,1]
["18",3,1,1]
["19",2,0,0]
["20",2,1,0]
["21",3,0,0]
["22",2,0,1]
["23",4,0,0]
["24",2,0,1]
["25",2,0,1]
["26",6,1,0]
["27",5,1,0]
["28",3,1,0]
["29",2,1,0]
["30",2,1,0]

{"sheet":"c_IndCalcs","index":13,"n_rows":23,"n_cols":47,"rows_kept":23,"cut":false,"hidden":false,"merged":[[10,35,11,38],[10,7,11,7],[10,3,11,5],[10,8,11,8],[3,3,4,8],[6,5,6,7],[7,5,7,7],[10,29,11,32],[8,5,8,7],[9,3,9,8],[10,10,11,14],[10,17,11,20],[10,23,11,26]]}
[]
[]
[]
[null,null,null,"Student Risk Status"]
[]
[]
[null,null,null,null,null,"Filter by Demographics:",null,null,1]
[null,null,null,null,null,"Filter by Cohort:",null,null,1]
[null,null,null,null,null,"Time Frame:",null,null,1]
[null,null,null,"To assign a student to an intervention, either 1) right-click the student's name and select \"Assign to Intervention\" or 2) click the \"Interventions\" button at the top of this page and enter the student's ID number."]
[null,null,null,"Student Details",null,null,null,"Incoming Indicator of Risk","Exam Performance Indicator",null,{"$f":"i_Settings!$B12 & \" Indicators of Risk\"","v":"Quarter 1 Indicators of Risk"},null,null,null,null,null,null,{"$f":"i_Settings!$B13 & \" Indicators of Risk\"","v":"Quarter 2 Indicators of Risk"},null,null,null,null,null,{"$f":"i_Settings!$B14 & \" Indicators of Risk\"","v":"Quarter 3 Indicators of Risk"},null,null,null,null,null,{"$f":"i_Settings!$B15 & \" Indicators of Risk\"","v":"Quarter 4 Indicators of Risk"},null,null,null,null,null,"Year Total Indicators of Risk"]
[null,null,null,null,null,null,null,null,null,null,null,null,null,null,null,null,null,null,null,null,null,null,null,null,null,null,null,null,null,null,null,null,null,null,null,null,null,null,null,null,null,null,null,"Views","Filters",{"$f":"COUNTA(AM:AM)-1","v":1},{"$f":"INDEX($AU$13:$AU$23,$I$7)&IF($I$8=1,\"*\",INDEX($AT$13:$AT$23,$I$8))","v":"???*"}]
[null,null,null,"Student ID","First Name","Last Name",null,"Flag for Incoming Indicator","Flag for Exam Performance",null,{"$f":"\"Flag for First \"&EarlyAtt&\" Day Attendance\"","v":"Flag for First 20 Day Attendance"},"Flag for Attendance","Flag for English Course Failed","Flag for Math Course Failed","Flag for Behavior",null,null,"Flag for Attendance","Flag for English Course Failed","Flag for Math Course Failed","Flag for Behavior",null,null,"Flag for Attendance","Flag for English Course Failed","Flag for Math Course Failed","Flag for Behavior",null,null,"Flag for Attendance","Flag for English Course Failed","Flag for Math Course Failed","Flag for Behavior",null,null,"Flag for Year Attendance","Flag for English Course Failed","Flag for Math Course Failed","Flag for Behavior",null,"Exit Indicator","Credits earned","eoy flag","All","All","All","???"]
[null,{"$f":"i_StudentInfo!M14","v":0},{"$f":"c_ReportData!Q13&c_ReportData!R13&c_ReportData!S13&c_ReportData!N13","v":""},{"$f":"i_StudentInfo!D14","v":0},{"$f":"i_StudentInfo!B14","v":0},{"$f":"i_StudentInfo!C14","v":0},null,{"$f":"IF(i_PerfData!G14=\"--\",\"--\",IF(i_PerfData!G14=\"No\",0,1))","v":"--"},{"$f":"IF(i_PerfData!H14=\"--\",\"--\",IF(i_PerfData!H14=\"No\",0,1))","v":"--"},{"$f":"i_StudentInfo!$O14","v":0},{"$f":"IF(OR(i_PerfData!I14=\"\",AND($J14>0,$J14<EarlyAtt)),\"--\",N(i_PerfData!I14/EarlyAtt>=Threshold_AttF20))","v":"--"},{"$f":"IF(i_PerfData!J14=\"\",\"--\",N(i_PerfData!J14/IF(J14=0,GP1_days,J14)>=Threshold_AttGP))","v":"--"},{"$f":"IF(i_PerfData!K14=\"\",\"--\",N(i_PerfData!K14>=Threshold_EngFailGP))","v":"--"},{"$f":"IF(i_PerfData!L14=\"\",\"--\",N(i_PerfData!L14>=Threshold_MathFailGP))","v":"--"},{"$f":"IF(i_PerfData!M14=\"\",\"--\",N(i_PerfData!M14>=Threshold_BehGP))","v":"--"},null,{"$f":"i_StudentInfo!$P14","v":0},{"$f":"IF(i_PerfData!N14=\"\",\"--\",N(i_PerfData!N14/IF(Q14=0,GP2_days,Q14)>=Threshold_AttGP))","v":"--"},{"$f":"IF(i_PerfData!O14=\"\",\"--\",N(i_PerfData!O14>=Threshold_EngFailGP))","v":"--"},{"$f":"IF(i_PerfData!P14=\"\",\"--\",N(i_PerfData!P14>=Threshold_MathFailGP))","v":"--"},{"$f":"IF(i_PerfData!Q14=\"\",\"--\",N(i_PerfData!Q14>=Threshold_BehGP))","v":"--"},null,{"$f":"i_StudentInfo!$Q14","v":0},{"$f":"IF(i_PerfData!R14=\"\",\"--\",N(i_PerfData!R14/IF(W14=0,GP3_days,W14)>=Threshold_AttGP))","v":"--"},{"$f":"IF(i_PerfData!S14=\"\",\"--\",N(i_PerfData!S14>=Threshold_EngFailGP))","v":"--"},{"$f":"IF(i_PerfData!T14=\"\",\"--\",N(i_PerfData!T14>=Threshold_MathFailGP))","v":"--"},{"$f":"IF(i_PerfData!U14=\"\",\"--\",N(i_PerfData!U14>=Threshold_BehGP))","v":"--"},null,{"$f":"i_StudentInfo!$R14","v":0},{"$f":"IF(i_PerfData!V14=\"\",\"--\",N(i_PerfData!V14/IF(AC14=0,GP4_days,AC14)>=Threshold_AttGP))","v":"--"},{"$f":"IF(i_PerfData!W14=\"\",\"--\",N(i_PerfData!W14>=Threshold_EngFailGP))","v":"--"},{"$f":"IF(i_PerfData!X14=\"\",\"--\",N(i_PerfData!X14>=Threshold_MathFailGP))","v":"--"},{"$f":"IF(i_PerfData!Y14=\"\",\"--\",N(i_PerfData!Y14>=Threshold_BehGP))","v":"--"},null,null,{"$f":"IF(OR($AQ14=0,$D14=0,i_PerfData!Z14=\"--\"),\"--\",IF(i_PerfData!Z14/IF(SUM(J14,Q14,W14,AC14)>0,SUM(J14,Q14,W14,AC14),SUM(i_Settings!$C$12:$C$15))>=Threshold_AttYr,1,0))","v":"--"},{"$f":"IF(OR($AQ14=0,$D14=0,i_PerfData!AA14=\"--\"),\"--\",IF(i_PerfData!AA14>=Threshold_EngFailYr,1,0))","v":"--"},{"$f":"IF(OR($AQ14=0,$D14=0,i_PerfData!AB14=\"--\"),\"--\",IF(i_PerfData!AB14>=Threshold_MathFailYr,1,0))","v":"--"},{"$f":"IF(OR($AQ14=0,$D14=0,i_PerfData!AC14=\"--\"),\"--\",IF(i_PerfData!AC14>=Threshold_BehYr,1,0))","v":"--"},null,{"$f":"IF(AQ14=0,\"--\",N(OR(SUM(AJ14:AM14)>0,IF(GP_Type=1,SUM(AD14:AG14)>0,IF(GP_Type=2,SUM(X14:AA14)>0,SUM(R14:U14)>0)))))","v":"--"},{"$f":"IF(OR($AQ14=0,$D14=0),\"--\",0)","v":"--"},{"$f":"IF(OR($B14=\"Dropped out\",$B14=\"Transferred out\",$B14=\"Graduated\",$D14=0),0,IF(TODAY()>=MAX(i_Settings!$E$12:$E$15),1,0))","v":0},{"$f":"i_Settings!$B12","v":"Quarter 1"},"Disabilities",{"$f":"IF(i_Settings!$G25=\"\",\"\",i_Settings!$G25)","v":"Cohort A"},"1??"]
[null,null,null,null,null,null,null,null,null,null,null,null,null,null,null,null,null,null,null,null,null,null,null,null,null,null,null,null,null,null,null,null,null,null,null,null,null,null,null,null,null,null,null,{"$f":"i_Settings!$B13","v":"Quarter 2"},"ELL Status",{"$f":"IF(i_Settings!$G26=\"\",\"\",i_Settings!$G26)","v":"Cohort B"},"?1?"]
[null,null,null,null,null,null,null,null,null,null,null,null,null,null,null,null,null,null,null,null,null,null,null,null,null,null,null,null,null,null,null,null,null,null,null,null,null,null,null,null,null,null,null,{"$f":"i_Settings!$B14","v":"Quarter 3"},"Disadvantaged",{"$f":"IF(i_Settings!$G27=\"\",\"\",i_Settings!$G27)","v":"Cohort C"},"??1"]
[null,null,null,null,null,null,null,null,null,null,null,null,null,null,null,null,null,null,null,null,null,null,null,null,null,null,null,null,null,null,null,null,null,null,null,null,null,null,null,null,null,null,null,{"$f":"i_Settings!$B15","v":"Quarter 4"},"Any",{"$f":"IF(i_Settings!$G28=\"\",\"\",i_Settings!$G28)","v":""},"*1*"]
[null,null,null,null,null,null,null,null,null,null,null,null,null,null,null,null,null,null,null,null,null,null,null,null,null,null,null,null,null,null,null,null,null,null,null,null,null,null,null,null,null,null,null,"Year totals",null,{"$f":"IF(i_Settings!$G29=\"\",\"\",i_Settings!$G29)","v":""}]
[null,null,null,null,null,null,null,null,null,null,null,null,null,null,null,null,null,null,null,null,null,null,null,null,null,null,null,null,null,null,null,null,null,null,null,null,null,null,null,null,null,null,null,null,null,{"$f":"IF(i_Settings!$G30=\"\",\"\",i_Settings!$G30)","v":""}]
[null,null,null,null,null,null,null,null,null,null,null,null,null,null,null,null,null,null,null,null,null,null,null,null,null,null,null,null,null,null,null,null,null,null,null,null,null,null,null,null,null,null,null,null,null,{"$f":"IF(i_Settings!$G31=\"\",\"\",i_Settings!$G31)","v":""}]
[null,null,null,null,null,null,null,null,null,null,null,null,null,null,null,null,null,null,null,null,null,null,null,null,null,null,null,null,null,null,null,null,null,null,null,null,null,null,null,null,null,null,null,null,null,{"$f":"IF(i_Settings!$G32=\"\",\"\",i_Settings!$G32)","v":""}]
[null,null,null,null,null,null,null,null,null,null,null,null,null,null,null,null,null,null,null,null,null,null,null,null,null,null,null,null,null,null,null,null,null,null,null,null,null,null,null,null,null,null,null,null,null,{"$f":"IF(i_Settings!$G33=\"\",\"\",i_Settings!$G33)","v":""}]
[null,null,null,null,null,null,null,null,null,null,null,null,null,null,null,null,null,null,null,null,null,null,null,null,null,null,null,null,null,null,null,null,null,null,null,null,null,null,null,null,null,null,null,null,null,{"$f":"IF(i_Settings!$G34=\"\",\"\",i_Settings!$G34)","v":""}]

{"sheet":"c_ProcessedInt","index":14,"n_rows":1,"n_cols":9,"rows_kept":1,"cut":false,"hidden":true,"merged":[]}
[null,null,null,null,null,null,null,null,{"$f":"COUNTA(A:A)","v":0}]

{"sheet":"c_ReportData","index":15,"n_rows":13,"n_cols":110,"rows_kept":13,"cut":false,"hidden":true,"merged":[]}
[null,null,null,null,null,null,null,null,null,null,null,null,null,null,null,null,null,null,null,null,null,null,null,null,null,null,null,null,null,null,null,null,null,null,null,null,null,null,null,null,null,null,null,null,null,null,null,null,null,null,null,null,null,null,null,null,null,null,null,null,null,null,null,null,null,null,null,null,null,null,null,null,null,null,null,null,null,null,null,null,null,null,null,null,null,null,null,null,null,null,null,null,null,null,null,null,null,null,null,null,null,null,null,null,null,null,null,null,{"$f":"COUNTA(CU:CU)-1","v":1}]
["[Select a field name]","[Select a field name]","[Select a field name]","[Select a field name]","[Select a field name]","[Select a field name]","[Select a field name]","[Select a field name]","[Select a field name]","[Select a field name]"]
[]
[]
[]
[]
[]
[]
[]
[{"$f":"INDEX(FieldNames!$E:$E,MATCH(A12,FieldNames!$A:$A,0))","v":"First Name"},{"$f":"INDEX(FieldNames!$E:$E,MATCH(B12,FieldNames!$A:$A,0))","v":"Last Name"},{"$f":"INDEX(FieldNames!$E:$E,MATCH(C12,FieldNames!$A:$A,0))","v":"Student ID"},{"$f":"INDEX(FieldNames!$E:$E,MATCH(D12,FieldNames!$A:$A,0))","v":"Grade"},{"$f":"INDEX(FieldNames!$E:$E,MATCH(E12,FieldNames!$A:$A,0))","v":"Guardian(s)"},{"$f":"INDEX(FieldNames!$E:$E,MATCH(F12,FieldNames!$A:$A,0))","v":"Phone #"},{"$f":"INDEX(FieldNames!$E:$E,MATCH(G12,FieldNames!$A:$A,0))","v":"Email"},{"$f":"INDEX(FieldNames!$E:$E,MATCH(H12,FieldNames!$A:$A,0))","v":"Date of Birth"},{"$f":"INDEX(FieldNames!$E:$E,MATCH(I12,FieldNames!$A:$A,0))","v":"Gender"},{"$f":"INDEX(FieldNames!$E:$E,MATCH(J12,FieldNames!$A:$A,0))","v":"Ethnicity"},{"$f":"INDEX(FieldNames!$E:$E,MATCH(K12,FieldNames!$A:$A,0))","v":"Disability"},{"$f":"INDEX(FieldNames!$E:$E,MATCH(L12,FieldNames!$A:$A,0))","v":"Disadvantaged"},{"$f":"INDEX(FieldNames!$E:$E,MATCH(M12,FieldNames!$A:$A,0))","v":"ELL Status"},"Cohort",{"$f":"INDEX(FieldNames!$E:$E,MATCH(O12,FieldNames!$A:$A,0))","v":"Enrollment Status"},{"$f":"INDEX(FieldNames!$E:$E,MATCH(P12,FieldNames!$A:$A,0))","v":"Date of Status Change"},{"$f":"INDEX(FieldNames!$E:$E,MATCH(Q12,FieldNames!$A:$A,0))","v":"Any Disability"},{"$f":"INDEX(FieldNames!$E:$E,MATCH(R12,FieldNames!$A:$A,0))","v":"Any ELL"},{"$f":"INDEX(FieldNames!$E:$E,MATCH(S12,FieldNames!$A:$A,0))","v":"Any Disadvantaged"},{"$f":"INDEX(FieldNames!$E:$E,MATCH(T12,FieldNames!$A:$A,0))","v":"No Characteristic"},{"$f":"INDEX(FieldNames!$E:$E,MATCH(U12,FieldNames!$A:$A,0))","v":"Any Characteristic"},{"$f":"INDEX(FieldNames!$E:$E,MATCH(V12,FieldNames!$A:$A,0))","v":"Incoming Risk Indicator"},{"$f":"INDEX(FieldNames!$E:$E,MATCH(W12,FieldNames!$A:$A,0))","v":"Exam Risk Indicator"},{"$f":"INDEX(FieldNames!$E:$E,MATCH(X12,FieldNames!$A:$A,0))","v":"Quarter 1 First 20 Day Attendance Flag"},{"$f":"INDEX(FieldNames!$E:$E,MATCH(Y12,FieldNames!$A:$A,0))","v":"Quarter 1 Attendance Flag"},{"$f":"INDEX(FieldNames!$E:$E,MATCH(Z12,FieldNames!$A:$A,0))","v":"Quarter 1 English Course Fail Flag"},{"$f":"INDEX(FieldNames!$E:$E,MATCH(AA12,FieldNames!$A:$A,0))","v":"Quarter 1 Math Course Fail Flag"},{"$f":"INDEX(FieldNames!$E:$E,MATCH(AB12,FieldNames!$A:$A,0))","v":"Quarter 1 Behavior Flag"},{"$f":"INDEX(FieldNames!$E:$E,MATCH(AC12,FieldNames!$A:$A,0))","v":"Quarter 1 Any Flag"},{"$f":"INDEX(FieldNames!$E:$E,MATCH(AD12,FieldNames!$A:$A,0))","v":"Quarter 1 Any Attendance Flag"},{"$f":"INDEX(FieldNames!$E:$E,MATCH(AE12,FieldNames!$A:$A,0))","v":"Quarter 1 Any Academic Flag"},{"$f":"INDEX(FieldNames!$E:$E,MATCH(AF12,FieldNames!$A:$A,0))","v":"Quarter 2 Attendance Flag"},{"$f":"INDEX(FieldNames!$E:$E,MATCH(AG12,FieldNames!$A:$A,0))","v":"Quarter 2 English Course Fail Flag"},{"$f":"INDEX(FieldNames!$E:$E,MATCH(AH12,FieldNames!$A:$A,0))","v":"Quarter 2 Math Course Fail Flag"},{"$f":"INDEX(FieldNames!$E:$E,MATCH(AI12,FieldNames!$A:$A,0))","v":"Quarter 2 Behavior Flag"},{"$f":"INDEX(FieldNames!$E:$E,MATCH(AJ12,FieldNames!$A:$A,0))","v":"Quarter 2 Any Flag"},{"$f":"INDEX(FieldNames!$E:$E,MATCH(AK12,FieldNames!$A:$A,0))","v":"Quarter 2 Any Academic Flag"},{"$f":"INDEX(FieldNames!$E:$E,MATCH(AL12,FieldNames!$A:$A,0))","v":"Quarter 3 Attendance Flag"},{"$f":"INDEX(FieldNames!$E:$E,MATCH(AM12,FieldNames!$A:$A,0))","v":"Quarter 3 English Course Fail Flag"},{"$f":"INDEX(FieldNames!$E:$E,MATCH(AN12,FieldNames!$A:$A,0))","v":"Quarter 3 Math Course Fail Flag"},{"$f":"INDEX(FieldNames!$E:$E,MATCH(AO12,FieldNames!$A:$A,0))","v":"Quarter 3 Behavior Flag"},{"$f":"INDEX(FieldNames!$E:$E,MATCH(AP12,FieldNames!$A:$A,0))","v":"Quarter 3 Any Flag"},{"$f":"INDEX(FieldNames!$E:$E,MATCH(AQ12,FieldNames!$A:$A,0))","v":"Quarter 3 Any Academic Flag"},{"$f":"INDEX(FieldNames!$E:$E,MATCH(AR12,FieldNames!$A:$A,0))","v":"Quarter 4 Attendance Flag"},{"$f":"INDEX(FieldNames!$E:$E,MATCH(AS12,FieldNames!$A:$A,0))","v":"Quarter 4 English Course Fail Flag"},{"$f":"INDEX(FieldNames!$E:$E,MATCH(AT12,FieldNames!$A:$A,0))","v":"Quarter 4 Math Course Fail Flag"},{"$f":"INDEX(FieldNames!$E:$E,MATCH(AU12,FieldNames!$A:$A,0))","v":"Quarter 4 Behavior Flag"},{"$f":"INDEX(FieldNames!$E:$E,MATCH(AV12,FieldNames!$A:$A,0))","v":"Quarter 4 Any Flag"},{"$f":"INDEX(FieldNames!$E:$E,MATCH(AW12,FieldNames!$A:$A,0))","v":"Quarter 4 Any Academic Flag"},{"$f":"INDEX(FieldNames!$E:$E,MATCH(AX12,FieldNames!$A:$A,0))","v":"Any Flag"},{"$f":"INDEX(FieldNames!$E:$E,MATCH(AY12,FieldNames!$A:$A,0))","v":"Any Attendance Flag"},{"$f":"INDEX(FieldNames!$E:$E,MATCH(AZ12,FieldNames!$A:$A,0))","v":"Any Academic Flag"},{"$f":"INDEX(FieldNames!$E:$E,MATCH(BA12,FieldNames!$A:$A,0))","v":"Any Behavior Flag"},{"$f":"INDEX(FieldNames!$E:$E,MATCH(BB12,FieldNames!$A:$A,0))","v":"End of Year Attendance Flag"},{"$f":"INDEX(FieldNames!$E:$E,MATCH(BC12,FieldNames!$A:$A,0))","v":"End of Year English Course Fail Flag"},{"$f":"INDEX(FieldNames!$E:$E,MATCH(BD12,FieldNames!$A:$A,0))","v":"End of Year Math Course Fail Flag"},{"$f":"INDEX(FieldNames!$E:$E,MATCH(BE12,FieldNames!$A:$A,0))","v":"End of Year Behavior Flag"},{"$f":"INDEX(FieldNames!$E:$E,MATCH(BF12,FieldNames!$A:$A,0))","v":"End of Year Core Course Fails Flag"},{"$f":"INDEX(FieldNames!$E:$E,MATCH(BG12,FieldNames!$A:$A,0))","v":"End of Year Credits Earned Flag"},{"$f":"INDEX(FieldNames!$E:$E,MATCH(BH12,FieldNames!$A:$A,0))","v":"End of Year Any Flag"},{"$f":"INDEX(FieldNames!$E:$E,MATCH(BI12,FieldNames!$A:$A,0))","v":"End of Year Any Academic Flag"},{"$f":"INDEX(FieldNames!$E:$E,MATCH(BJ12,FieldNames!$A:$A,0))","v":"Quarter 1 Both Attendance and Academic Flags"},{"$f":"INDEX(FieldNames!$E:$E,MATCH(BK12,FieldNames!$A:$A,0))","v":"Quarter 2 Both Attendance and Academic Flags"},{"$f":"INDEX(FieldNames!$E:$E,MATCH(BL12,FieldNames!$A:$A,0))","v":"Quarter 3 Both Attendance and Academic Flags"},{"$f":"INDEX(FieldNames!$E:$E,MATCH(BM12,FieldNames!$A:$A,0))","v":"Quarter 4 Both Attendance and Academic Flags"},{"$f":"INDEX(FieldNames!$E:$E,MATCH(BN12,FieldNames!$A:$A,0))","v":"End of Year Both Attendance and Academic Flags"},{"$f":"INDEX(FieldNames!$E:$E,MATCH(BO12,FieldNames!$A:$A,0))","v":"Participated in Tier 1 Attendance Intervention"},{"$f":"INDEX(FieldNames!$E:$E,MATCH(BP12,FieldNames!$A:$A,0))","v":"Participated in Tier 2 Attendance Intervention"},{"$f":"INDEX(FieldNames!$E:$E,MATCH(BQ12,FieldNames!$A:$A,0))","v":"Participated in Tier 3 Attendance Intervention"},{"$f":"INDEX(FieldNames!$E:$E,MATCH(BR12,FieldNames!$A:$A,0))","v":"Participated in Tier 1 Behavior Intervention"},{"$f":"INDEX(FieldNames!$E:$E,MATCH(BS12,FieldNames!$A:$A,0))","v":"Participated in Tier 2 Behavior Intervention"},{"$f":"INDEX(FieldNames!$E:$E,MATCH(BT12,FieldNames!$A:$A,0))","v":"Participated in Tier 3 Behavior Intervention"},{"$f":"INDEX(FieldNames!$E:$E,MATCH(BU12,FieldNames!$A:$A,0))","v":"Participated in Tier 1 Academic Intervention"},{"$f":"INDEX(FieldNames!$E:$E,MATCH(BV12,FieldNames!$A:$A,0))","v":"Participated in Tier 2 Academic Intervention"},{"$f":"INDEX(FieldNames!$E:$E,MATCH(BW12,FieldNames!$A:$A,0))","v":"Participated in Tier 3 Academic Intervention"},{"$f":"INDEX(FieldNames!$E:$E,MATCH(BX12,FieldNames!$A:$A,0))","v":"Combined Enrollment Status and CCSR End of Year Flag"},{"$f":"INDEX(FieldNames!$E:$E,MATCH(BY12,FieldNames!$A:$A,0))","v":"Enrollment Status and GP of Status Change"},{"$f":"INDEX(FieldNames!$E:$E,MATCH(BZ12,FieldNames!$A:$A,0))","v":"Pre-HS Interventions"},{"$f":"INDEX(FieldNames!$E:$E,MATCH(CA12,FieldNames!$A:$A,0))","v":"Quarter 1 Interventions"},{"$f":"INDEX(FieldNames!$E:$E,MATCH(CB12,FieldNames!$A:$A,0))","v":"Quarter 2 Interventions"},{"$f":"INDEX(FieldNames!$E:$E,MATCH(CC12,FieldNames!$A:$A,0))","v":"Quarter 3 Interventions"},{"$f":"INDEX(FieldNames!$E:$E,MATCH(CD12,FieldNames!$A:$A,0))","v":"Quarter 4 Interventions"},{"$f":"INDEX(FieldNames!$E:$E,MATCH(CE12,FieldNames!$A:$A,0))","v":"All Interventions"},{"$f":"INDEX(FieldNames!$E:$E,MATCH(CF12,FieldNames!$A:$A,0))","v":"Participated Quarter 1"},{"$f":"INDEX(FieldNames!$E:$E,MATCH(CG12,FieldNames!$A:$A,0))","v":"Participated Quarter 2"},{"$f":"INDEX(FieldNames!$E:$E,MATCH(CH12,FieldNames!$A:$A,0))","v":"Participated Quarter 3"},{"$f":"INDEX(FieldNames!$E:$E,MATCH(CI12,FieldNames!$A:$A,0))","v":"Participated Quarter 4"},{"$f":"INDEX(FieldNames!$E:$E,MATCH(CJ12,FieldNames!$A:$A,0))","v":"Quarter 1 Participated in Selected Intervention (school report)"},{"$f":"INDEX(FieldNames!$E:$E,MATCH(CK12,FieldNames!$A:$A,0))","v":"Quarter 2 Participated in Selected Intervention (school report)"},{"$f":"INDEX(FieldNames!$E:$E,MATCH(CL12,FieldNames!$A:$A,0))","v":"Quarter 3 Participated in Selected Intervention (school report)"},{"$f":"INDEX(FieldNames!$E:$E,MATCH(CM12,FieldNames!$A:$A,0))","v":"Quarter 4 Participated in Selected Intervention (school report)"},{"$f":"INDEX(FieldNames!$E:$E,MATCH(CN12,FieldNames!$A:$A,0))","v":"Participated in Selected Intervention (school report)"},{"$f":"INDEX(FieldNames!$E:$E,MATCH(CO12,FieldNames!$A:$A,0))","v":"Student Captured by Filter"}]
[null,null,null,null,null,null,null,null,null,null,null,null,null,null,null,null,null,null,null,null,null,"Pre-HS indicator","Exam indicator","GP1 Indicators",null,null,null,null,null,null,null,"GP2 Indicators",null,null,null,null,null,"GP3 Indicators",null,null,null,null,null,"GP4 Indicators",null,null,null,null,null,null,null,null,null,"Year indicators"]
["First Name","Last Name","Student ID","Grade","Guardian(s)","Phone #","Email","DOB","Gender","Ethnicity","Disability","Disadvantaged","ELL Status","Cohort","Enrollment Status","Date of Status Change","Disability flag","ELL flag","Disadvantaged flag","No char flag","Any char flag","Pre-HS indicator","Exam indicator",{"$f":"\"GP1_First \"&EarlyAtt&\" Day Attendance\"","v":"GP1_First 20 Day Attendance"},"GP1_Attendance","GP1_EngCourseFail","GP1_MathCourseFail","GP1_Behavior","GP1_Any Flag","GP1_Any att","GP1_Any acad","GP2_Attendance","GP2_EngCourseFail","GP2_MathCourseFail","GP2_Behavior","GP2_Any Flag","GP2_Any acad","GP3_Attendance","GP3_EngCourseFail","GP3_MathCourseFail","GP3_Behavior","GP3_Any Flag","GP3_Any acad","GP4_Attendance","GP4_EngCourseFail","GP4_MathCourseFail","GP4_Behavior","GP4_Any Flag","GP4_Any acad","Any Flag","Any att","Any acad","Any beh","eoy_Attendance","eoy_EngCourseFail","eoy_MathCourseFail","eoy_Behavior","eoy_Core course fails","eoy_Credits earned","eoy_Any flag","eoy_Any acad","GP1_Attendance & Academic","GP2_Attendance & Academic","GP3_Attendance & Academic","GP4_Attendance & Academic","eoy_Attendance & Academic","AttTier1","AttTier2","AttTier3","BehTier1","BehTier2","BehTier3","AcaTier1","AcaTier2","AcaTier3","EOY status flag","Drop/transfer out","Pre-HS Interventions","GP1 Interventions","GP2 Interventions","GP3 Interventions","GP4 Interventions","All interventions","GP1_Int Flag","GP2_Int Flag","GP3_Int Flag","GP4_Int Flag","GP1_Int sum","GP2_Int sum","GP3_Int sum","GP4_Int sum","eoy_Int sum","FilterMatch","AnyAttInt","AnyBehInt","AnyAcadInt","AnyT1Int","AnyT2Int","AnyT3Int","GP1_days","GP2_days","GP3_days","GP4_days","School_cohort","Student_cohort","KG_Entered","ExpectedGrade","Overage",null,"Student ID"]
[{"$f":"IF(i_StudentInfo!B14=\"\",\"\",i_StudentInfo!B14)","v":""},{"$f":"IF(i_StudentInfo!C14=\"\",\"\",i_StudentInfo!C14)","v":""},{"$f":"IF(i_StudentInfo!D14=\"\",\"\",i_StudentInfo!D14)","v":""},{"$f":"IF(i_StudentInfo!E14=\"\",\"\",i_StudentInfo!E14)","v":""},{"$f":"IF(i_StudentInfo!S14=\"\",\"\",i_StudentInfo!S14)","v":""},{"$f":"IF(i_StudentInfo!T14=\"\",\"\",i_StudentInfo!T14)","v":""},{"$f":"IF(i_StudentInfo!U14=\"\",\"\",i_StudentInfo!U14)","v":""},{"$f":"IF(i_StudentInfo!F14=\"\",\"\",i_StudentInfo!F14)","v":""},{"$f":"IF(i_StudentInfo!G14=\"\",\"\",i_StudentInfo!G14)","v":""},{"$f":"IF(i_StudentInfo!H14=\"\",\"\",i_StudentInfo!H14)","v":""},{"$f":"IF(i_StudentInfo!I14=\"\",\"\",i_StudentInfo!I14)","v":""},{"$f":"IF(i_StudentInfo!J14=\"\",\"\",i_StudentInfo!J14)","v":""},{"$f":"IF(i_StudentInfo!K14=\"\",\"\",i_StudentInfo!K14)","v":""},{"$f":"IF(i_StudentInfo!L14=\"\",\"\",i_StudentInfo!L14)","v":""},{"$f":"IF(i_StudentInfo!M14=\"\",\"\",i_StudentInfo!M14)","v":""},{"$f":"IF(i_StudentInfo!N14=\"\",\"\",i_StudentInfo!N14)","v":""},{"$f":"IF(C13=\"\",\"\",1-COUNTBLANK(K13))","v":""},{"$f":"IF(C13=\"\",\"\",1-COUNTBLANK(M13))","v":""},{"$f":"IF(C13=\"\",\"\",1-COUNTBLANK(L13))","v":""},{"$f":"IF(C13=\"\",\"\",N(SUM(Q13:S13)=0))","v":""},{"$f":"1-T13","v":{"$error":"#VALUE!"}},{"$f":"IF(C13=\"\",\"\",c_IndCalcs!H14)","v":""},{"$f":"IF(C13=\"\",\"\",c_IndCalcs!I14)","v":""},{"$f":"IF(c_IndCalcs!K14=\"\",\"\",c_IndCalcs!K14)","v":"--"},{"$f":"IF(c_IndCalcs!L14=\"\",\"\",c_IndCalcs!L14)","v":"--"},{"$f":"IF(c_IndCalcs!M14=\"\",\"\",c_IndCalcs!M14)","v":"--"},{"$f":"IF(c_IndCalcs!N14=\"\",\"\",c_IndCalcs!N14)","v":"--"},{"$f":"IF(c_IndCalcs!O14=\"\",\"\",c_IndCalcs!O14)","v":"--"},{"$f":"IF(COUNT(X13:AB13)>0,N(SUM(X13:AB13)>0),\"--\")","v":"--"},{"$f":"IF(COUNT(X13:Y13)>0,N(SUM(X13:Y13)>0),\"--\")","v":"--"},{"$f":"IF(COUNT(Z13:AA13)>0,N(SUM(Z13:AA13)>0),\"--\")","v":"--"},{"$f":"IF(c_IndCalcs!R14=\"\",\"\",c_IndCalcs!R14)","v":"--"},{"$f":"IF(c_IndCalcs!S14=\"\",\"\",c_IndCalcs!S14)","v":"--"},{"$f":"IF(c_IndCalcs!T14=\"\",\"\",c_IndCalcs!T14)","v":"--"},{"$f":"IF(c_IndCalcs!U14=\"\",\"\",c_IndCalcs!U14)","v":"--"},{"$f":"IF(COUNT(AF13:AI13)>0,N(SUM(AF13:AI13)>0),\"--\")","v":"--"},{"$f":"IF(COUNT(AG13:AH13)>0,N(SUM(AG13:AH13)>0),\"--\")","v":"--"},{"$f":"IF(c_IndCalcs!X14=\"\",\"\",c_IndCalcs!X14)","v":"--"},{"$f":"IF(c_IndCalcs!Y14=\"\",\"\",c_IndCalcs!Y14)","v":"--"},{"$f":"IF(c_IndCalcs!Z14=\"\",\"\",c_IndCalcs!Z14)","v":"--"},{"$f":"IF(c_IndCalcs!AA14=\"\",\"\",c_IndCalcs!AA14)","v":"--"},{"$f":"IF(COUNT(AL13:AO13)>0,N(SUM(AL13:AO13)>0),\"--\")","v":"--"},{"$f":"IF(COUNT(AM13:AN13)>0,N(SUM(AM13:AN13)>0),\"--\")","v":"--"},{"$f":"IF(c_IndCalcs!AD14=\"\",\"\",c_IndCalcs!AD14)","v":"--"},{"$f":"IF(c_IndCalcs!AE14=\"\",\"\",c_IndCalcs!AE14)","v":"--"},{"$f":"IF(c_IndCalcs!AF14=\"\",\"\",c_IndCalcs!AF14)","v":"--"},{"$f":"IF(c_IndCalcs!AG14=\"\",\"\",c_IndCalcs!AG14)","v":"--"},{"$f":"IF(COUNT(AR13:AU13)>0,N(SUM(AR13:AU13)>0),\"--\")","v":"--"},{"$f":"IF(COUNT(AS13:AT13)>0,N(SUM(AS13:AT13)>0),\"--\")","v":"--"},{"$f":"IF(C13=\"\",\"\",IF(COUNT($X13:$AV13,BH13)=0,\"--\",N(SUM(X13:AV13,BH13)>0)))","v":""},{"$f":"IF(C13=\"\",\"\",IF(COUNT(X13:Y13,AF13,AL13,AR13)=0,\"--\",N(SUM(X13:Y13,AF13,AL13,AR13)>0)))","v":""},{"$f":"IF(C13=\"\",\"\",IF(COUNT(Z13:AA13,AG13:AH13,AM13:AN13,AS13:AT13)=0,\"--\",N(SUM(Z13:AA13,AG13:AH13,AM13:AN13,AS13:AT13)>0)))","v":""},{"$f":"IF(D13=\"\",\"\",IF(COUNT(AB13,AI13,AO13,AU13)=0,\"--\",N(SUM(AB13,AI13,AO13,AU13)>0)))","v":""},{"$f":"IF(c_IndCalcs!AJ14=\"\",\"\",c_IndCalcs!AJ14)","v":"--"},{"$f":"IF(c_IndCalcs!AK14=\"\",\"\",c_IndCalcs!AK14)","v":"--"},{"$f":"IF(c_IndCalcs!AL14=\"\",\"\",c_IndCalcs!AL14)","v":"--"},{"$f":"IF(c_IndCalcs!AM14=\"\",\"\",c_IndCalcs!AM14)","v":"--"},{"$f":"IF(c_IndCalcs!AO14=\"\",\"\",c_IndCalcs!AO14)","v":"--"},{"$f":"IF(c_IndCalcs!AP14=\"\",\"\",c_IndCalcs!AP14)","v":"--"},{"$f":"IF(COUNT(BB13:BE13)>0,N(SUM(BB13:BE13)>0),\"--\")","v":"--"},{"$f":"IF(COUNT(BC13:BD13)>0,N(SUM(BC13:BD13)>0),\"--\")","v":"--"},{"$f":"IF(COUNT(X13:AA13)=0,\"--\",IF(AND(OR(X13=1,Y13=1),OR(Z13=1,AA13=1)),1,0))","v":"--"},{"$f":"IF(COUNT(AF13:AH13)=0,\"--\",IF(AND(AF13=1,OR(AG13=1,AH13=1)),1,0))","v":"--"},{"$f":"IF(COUNT(AL13:AN13)=0,\"--\",IF(AND(AL13=1,OR(AM13=1,AN13=1)),1,0))","v":"--"},{"$f":"IF(COUNT(AR13:AT13)=0,\"--\",IF(AND(AR13=1,OR(AS13=1,AT13=1)),1,0))","v":"--"},{"$f":"IF(COUNT(BB13:BD13)=0,\"--\",IF(AND(BB13=1,OR(BC13=1,BF13=1,BD13=1)),1,0))","v":"--"},{"$f":"IF($C13=\"\",\"\",N(COUNTIF(i_Int!$T:$T,$C13&\"Attendance\"&\"I\")>0))","v":""},{"$f":"IF($C13=\"\",\"\",N(COUNTIF(i_Int!$T:$T,$C13&\"Attendance\"&\"II\")>0))","v":""},{"$f":"IF($C13=\"\",\"\",N(COUNTIF(i_Int!$T:$T,$C13&\"Attendance\"&\"III\")>0))","v":""},{"$f":"IF($C13=\"\",\"\",N(COUNTIF(i_Int!$T:$T,$C13&\"Behavior\"&\"I\")>0))","v":""},{"$f":"IF($C13=\"\",\"\",N(COUNTIF(i_Int!$T:$T,$C13&\"Behavior\"&\"II\")>0))","v":""},{"$f":"IF($C13=\"\",\"\",N(COUNTIF(i_Int!$T:$T,$C13&\"Behavior\"&\"III\")>0))","v":""},{"$f":"IF($C13=\"\",\"\",N(COUNTIF(i_Int!$T:$T,$C13&\"Academic\"&\"I\")>0))","v":""},{"$f":"IF($C13=\"\",\"\",N(COUNTIF(i_Int!$T:$T,$C13&\"Academic\"&\"II\")>0))","v":""},{"$f":"IF($C13=\"\",\"\",N(COUNTIF(i_Int!$T:$T,$C13&\"Academic\"&\"III\")>0))","v":""},{"$f":"O13&BH13","v":"--"},{"$f":"IF(OR(O13=\"Dropped Out\",O13=\"Transferred Out\",O13=\"Graduated\"),O13&MATCH(P13,i_Settings!$D$12:$D$15,1),\"\")","v":""},{"$f":"IF(OR($C13=\"\",ISERROR(MATCH($C13,ProcessedIDs,0))),\"--\",IF(INDEX(c_ProcessedInt!B:B,MATCH($C13,ProcessedIDs,0))=0,\"--\",INDEX(c_ProcessedInt!B:B,MATCH($C13,ProcessedIDs,0))))","v":"--"},{"$f":"IF(OR($C13=\"\",ISERROR(MATCH($C13,ProcessedIDs,0))),\"--\",IF(INDEX(c_ProcessedInt!C:C,MATCH($C13,ProcessedIDs,0))=0,\"--\",INDEX(c_ProcessedInt!C:C,MATCH($C13,ProcessedIDs,0))))","v":"--"},{"$f":"IF(OR($C13=\"\",ISERROR(MATCH($C13,ProcessedIDs,0))),\"--\",IF(INDEX(c_ProcessedInt!D:D,MATCH($C13,ProcessedIDs,0))=0,\"--\",INDEX(c_ProcessedInt!D:D,MATCH($C13,ProcessedIDs,0))))","v":"--"},{"$f":"IF(OR($C13=\"\",ISERROR(MATCH($C13,ProcessedIDs,0))),\"--\",IF(INDEX(c_ProcessedInt!E:E,MATCH($C13,ProcessedIDs,0))=0,\"--\",INDEX(c_ProcessedInt!E:E,MATCH($C13,ProcessedIDs,0))))","v":"--"},{"$f":"IF(OR($C13=\"\",ISERROR(MATCH($C13,ProcessedIDs,0))),\"--\",IF(INDEX(c_ProcessedInt!F:F,MATCH($C13,ProcessedIDs,0))=0,\"--\",INDEX(c_ProcessedInt!F:F,MATCH($C13,ProcessedIDs,0))))","v":"--"},{"$f":"IF(CA13=\"--\",\"\",CA13)&IF(CB13=\"--\",\"\",CB13)&IF(CC13=\"--\",\"\",CC13)&IF(CD13=\"--\",\"\",CD13)","v":""},{"$f":"IF(ISERROR(SEARCH(INDEX(CurrInterventions,i_ReportFilters!$D$13),CA13)),0,1)","v":1},{"$f":"IF(ISERROR(SEARCH(INDEX(CurrInterventions,i_ReportFilters!$D$13),CB13)),0,1)","v":1},{"$f":"IF(ISERROR(SEARCH(INDEX(CurrInterventions,i_ReportFilters!$D$13),CC13)),0,1)","v":1},{"$f":"IF(ISERROR(SEARCH(INDEX(CurrInterventions,i_ReportFilters!$D$13),CD13)),0,1)","v":1},{"$f":"IF(CA13=\"--\",\"--\",N(IF(ISERROR(SEARCH(o_SchIntSum!$Y$6,CA13)),0,SEARCH(o_SchIntSum!$Y$6,CA13))>0))","v":"--"},{"$f":"IF(CB13=\"--\",\"--\",N(IF(ISERROR(SEARCH(o_SchIntSum!$Y$6,CB13)),0,SEARCH(o_SchIntSum!$Y$6,CB13))>0))","v":"--"},{"$f":"IF(CC13=\"--\",\"--\",N(IF(ISERROR(SEARCH(o_SchIntSum!$Y$6,CC13)),0,SEARCH(o_SchIntSum!$Y$6,CC13))>0))","v":"--"},{"$f":"IF(CD13=\"--\",\"--\",N(IF(ISERROR(SEARCH(o_SchIntSum!$Y$6,CD13)),0,SEARCH(o_SchIntSum!$Y$6,CD13))>0))","v":"--"},{"$f":"IF(CE13=\"--\",\"--\",N(IF(ISERROR(SEARCH(o_SchIntSum!$Y$6,CE13)),0,SEARCH(o_SchIntSum!$Y$6,CE13))>0))","v":0},{"$f":"IF(C13=\"\",0,COUNTIF($DF:$DF,$C13))","v":0},{"$f":"N(SUM(BO13:BQ13)>0)","v":0},{"$f":"N(SUM(BR13:BT13)>0)","v":0},{"$f":"N(SUM(BU13:BW13)>0)","v":0},{"$f":"N(SUM(BO13,BR13,BU13)>0)","v":0},{"$f":"N(SUM(BP13,BS13,BV13)>0)","v":0},{"$f":"N(SUM(BQ13,BT13,BW13)>0)","v":0},{"$f":"IF(i_StudentInfo!O14=\"\",\"\",i_StudentInfo!O14)","v":""},{"$f":"IF(i_StudentInfo!P14=\"\",\"\",i_StudentInfo!P14)","v":""},{"$f":"IF(i_StudentInfo!Q14=\"\",\"\",i_StudentInfo!Q14)","v":""},{"$f":"IF(i_StudentInfo!R14=\"\",\"\",i_StudentInfo!R14)","v":""},{"$f":"IF(o_IndSummary!$D$8=\"All\",1,IF($N13=o_IndSummary!$D$8,1,0))","v":1},{"$f":"IF(i_ReportFilters!$F$13=1,1,IF($N13=INDEX(i_ReportFilters!$AI$5:$AI$15,i_ReportFilters!$F$13),1,0))","v":1},{"$f":"IF(DATE(YEAR(H13)+5,MONTH(H13),DAY(H13))>DATE(YEAR(H13)+5,MONTH(KG_CutOff),DAY(KG_CutOff)),YEAR(H13)+6,YEAR(H13)+5)","v":{"$error":"#VALUE!"}},{"$f":"YEAR(i_Settings!$D$12)-DB13","v":{"$error":"#VALUE!"}},{"$f":"IF(ISERROR(DC13),\"\",IF(DC13>D13,1,0))","v":""},null,""]

{"sheet":"i_Int","index":16,"n_rows":25,"n_cols":43,"rows_kept":25,"cut":false,"hidden":false,"merged":[[14,7,15,7],[23,27,23,28],[16,1,16,2],[17,1,17,2],[18,1,18,2],[19,1,19,2],[20,1,20,2],[22,1,23,8],[24,4,24,5],[21,1,21,7],[3,1,4,8],[6,3,6,8],[10,2,10,3],[11,2,11,3],[8,5,8,6],[9,5,9,6],[10,5,10,6],[12,4,12,5],[11,5,11,6],[12,2,12,3],[14,3,15,3],[14,4,15,4],[14,5,15,5],[14,6,15,6]]}
[]
[]
[]
[null,"Student Interventions"]
[]
[]
[null,null,null,"Enter the start and end dates of the student’s participation in the intervention. If the start date of the assigned interventions occur before the start of the school year (GP1), the tool recognizes this as an intervention that occurred prior to the start of the academic year (i.e. summer school)."]
[]
[null,"Student ID:",null,null,"Disability:",{"$f":"IF(IntID=\"\",\"\",INDEX(i_StudentInfo!$I:$I,MATCH($C$9,i_StudentInfo!$D:$D,0)))","v":""},null,null,{"$f":"ROW(IntHeadings)+TotalInt+1","v":26}]
[null,null,{"$f":"IF(AND(OR(IntID<>\"\",),IntIDValid=0),\"Invalid ID\",\"\")","v":""},null,"Disadvantaged:",{"$f":"IF(IntID=\"\",\"\",INDEX(i_StudentInfo!$J:$J,MATCH($C$9,i_StudentInfo!$D:$D,0)))","v":""},null,null,{"$f":"IF(OR(IntID=\"\",ISERROR(MATCH(IntID,i_StudentInfo!$X:$X,0))),0,MATCH(IntID,i_StudentInfo!$X:$X,0))","v":0}]
[null,"First Name:",{"$f":"IF(IntID=\"\",\"\",INDEX(i_StudentInfo!$B:$B,MATCH($C$9,i_StudentInfo!$D:$D,0)))","v":""},null,"ELL:",{"$f":"IF(IntID=\"\",\"\",INDEX(i_StudentInfo!$K:$K,MATCH($C$9,i_StudentInfo!$D:$D,0)))","v":""}]
[null,"Last Name:",{"$f":"IF(IntID=\"\",\"\",INDEX(i_StudentInfo!$C:$C,MATCH($C$9,i_StudentInfo!$D:$D,0)))","v":""},null,"Cohort:",{"$f":"IF(IntID=\"\",\"\",INDEX(i_StudentInfo!$L:$L,MATCH($C$9,i_StudentInfo!$D:$D,0)))","v":""}]
[null,"Grade:",{"$f":"IF(IntID=\"\",\"\",INDEX(i_StudentInfo!$E:$E,MATCH($C$9,i_StudentInfo!$D:$D,0)))","v":""},null,"Interventions Found:",null,{"$f":"IF(IntID=\"\",0,COUNTIF(B:B,IntID))","v":0}]
[null,"Flags"]
[null,"Incoming:",{"$f":"IF($I$10>0,OFFSET(c_IndCalcs!$H$1,MATCH(IntID,c_IndCalcs!$D:$D,0)-1,0),\"--\")","v":"--"},{"$f":"i_Settings!$B$12","v":"Quarter 1"},{"$f":"i_Settings!$B$13","v":"Quarter 2"},{"$f":"i_Settings!$B$14","v":"Quarter 3"},{"$f":"i_Settings!$B$15","v":"Quarter 4"},"End of Year"]
[null,"Exam Performance:",{"$f":"IF($I$10>0,OFFSET(c_IndCalcs!$I$1,MATCH(IntID,c_IndCalcs!$D:$D,0)-1,0),\"--\")","v":"--"}]
[null,{"$f":"\"First \"&EarlyAtt&\" Day Attendance:\"","v":"First 20 Day Attendance:"},null,{"$f":"IF($I$10>0,OFFSET(c_IndCalcs!$K$1,MATCH(IntID,c_IndCalcs!$D:$D,0)-1,0),\"--\")","v":"--"},"--","--","--","--"]
[null,"Attendance:",null,{"$f":"IF($I$10>0,OFFSET(c_IndCalcs!$L$1,MATCH(IntID,c_IndCalcs!$D:$D,0)-1,0),\"--\")","v":"--"},{"$f":"IF($I$10>0,OFFSET(c_IndCalcs!$R$1,MATCH(IntID,c_IndCalcs!$D:$D,0)-1,0),\"--\")","v":"--"},{"$f":"IF($I$10>0,OFFSET(c_IndCalcs!$X$1,MATCH(IntID,c_IndCalcs!$D:$D,0)-1,0),\"--\")","v":"--"},{"$f":"IF($I$10>0,OFFSET(c_IndCalcs!$AD$1,MATCH(IntID,c_IndCalcs!$D:$D,0)-1,0),\"--\")","v":"--"},{"$f":"IF($I$10>0,OFFSET(c_IndCalcs!$AJ$1,MATCH(IntID,c_IndCalcs!$D:$D,0)-1,0),\"--\")","v":"--"}]
[null,"English Course Failed:",null,{"$f":"IF($I$10>0,OFFSET(c_IndCalcs!$M$1,MATCH(IntID,c_IndCalcs!$D:$D,0)-1,0),\"--\")","v":"--"},{"$f":"IF($I$10>0,OFFSET(c_IndCalcs!$S$1,MATCH(IntID,c_IndCalcs!$D:$D,0)-1,0),\"--\")","v":"--"},{"$f":"IF($I$10>0,OFFSET(c_IndCalcs!$Y$1,MATCH(IntID,c_IndCalcs!$D:$D,0)-1,0),\"--\")","v":"--"},{"$f":"IF($I$10>0,OFFSET(c_IndCalcs!$AE$1,MATCH(IntID,c_IndCalcs!$D:$D,0)-1,0),\"--\")","v":"--"},{"$f":"IF($I$10>0,OFFSET(c_IndCalcs!$AK$1,MATCH(IntID,c_IndCalcs!$D:$D,0)-1,0),\"--\")","v":"--"}]
[null,"Math Course Failed:",null,{"$f":"IF($I$10>0,OFFSET(c_IndCalcs!$N$1,MATCH(IntID,c_IndCalcs!$D:$D,0)-1,0),\"--\")","v":"--"},{"$f":"IF($I$10>0,OFFSET(c_IndCalcs!$T$1,MATCH(IntID,c_IndCalcs!$D:$D,0)-1,0),\"--\")","v":"--"},{"$f":"IF($I$10>0,OFFSET(c_IndCalcs!$Z$1,MATCH(IntID,c_IndCalcs!$D:$D,0)-1,0),\"--\")","v":"--"},{"$f":"IF($I$10>0,OFFSET(c_IndCalcs!$AF$1,MATCH(IntID,c_IndCalcs!$D:$D,0)-1,0),\"--\")","v":"--"},{"$f":"IF($I$10>0,OFFSET(c_IndCalcs!$AL$1,MATCH(IntID,c_IndCalcs!$D:$D,0)-1,0),\"--\")","v":"--"}]
[null,"Behavior:",null,{"$f":"IF($I$10>0,OFFSET(c_IndCalcs!$O$1,MATCH(IntID,c_IndCalcs!$D:$D,0)-1,0),\"--\")","v":"--"},{"$f":"IF($I$10>0,OFFSET(c_IndCalcs!$U$1,MATCH(IntID,c_IndCalcs!$D:$D,0)-1,0),\"--\")","v":"--"},{"$f":"IF($I$10>0,OFFSET(c_IndCalcs!$AA$1,MATCH(IntID,c_IndCalcs!$D:$D,0)-1,0),\"--\")","v":"--"},{"$f":"IF($I$10>0,OFFSET(c_IndCalcs!$AG$1,MATCH(IntID,c_IndCalcs!$D:$D,0)-1,0),\"--\")","v":"--"},{"$f":"IF($I$10>0,OFFSET(c_IndCalcs!$AM$1,MATCH(IntID,c_IndCalcs!$D:$D,0)-1,0),\"--\")","v":"--"}]
[]
[null,"Intervention Details"]
[null,null,null,null,null,null,null,null,null,null,null,null,null,null,null,null,null,null,null,null,null,null,null,null,null,{"$f":"INDEX(i_StudentInfo!$B:$B,MATCH(Y24,i_StudentInfo!$D:$D,0))","v":{"$error":"#N/A"}},{"$f":"INDEX(i_StudentInfo!$C:$C,MATCH(Y24,i_StudentInfo!$D:$D,0))","v":{"$error":"#N/A"}},null,null,null,null,null,{"$f":"IF(AB24=\"\",\"\",INDEX(i_IntDesc!$C$12:$C$30,MATCH(AB24,i_IntDesc!$B$12:$B$30,0)))","v":""},{"$f":"IF(AB24=\"\",\"\",INDEX(i_IntDesc!$D$12:$D$30,MATCH(AB24,i_IntDesc!$B$12:$B$30,0)))","v":""},{"$f":"IF(AD24=\"\",\"\",IF(ISERROR(MATCH(AD24,i_Settings!$D$12:$D$15,1)),0,MATCH(AD24,i_Settings!$D$12:$D$15,1)))","v":""},{"$f":"IF(AD24=\"\",\"\",IF(ISERROR(MATCH(IF(AE24=\"\",TODAY(),AE24),i_Settings!$D$12:$D$15,1)),0,MATCH(IF(AE24=\"\",TODAY(),AE24),i_Settings!$D$12:$D$15,1)))","v":""},{"$f":"IF(AD24>TODAY(),IF(AI24=AK$25,1,0),IF(AND(AI24<=AK$25,AJ24>=AK$25),1,0))","v":1},{"$f":"IF(AD24>TODAY(),IF(AI24=AL$25,1,0),IF(AND(AI24<=AL$25,AJ24>=AL$25),1,0))","v":1},{"$f":"IF(AD24>TODAY(),IF(AI24=AM$25,1,0),IF(AND(AI24<=AM$25,AJ24>=AM$25),1,0))","v":1},{"$f":"IF(AD24>TODAY(),IF(AI24=AN$25,1,0),IF(AND(AI24<=AN$25,AJ24>=AN$25),1,0))","v":1},{"$f":"IF(AD24>TODAY(),IF(AI24=AO$25,1,0),IF(AND(AI24<=AO$25,AJ24>=AO$25),1,0))","v":1},{"$f":"Y24&AG24&AH24","v":""},{"$f":"IF(AND(AK24=1,SUM(AL24:AO24)=0),\"\",Y24&AG24&AH24)","v":""}]
[null,"Student ID","First Name","Last Name","Intervention",null,"Start","End","Comments","Type","Tier","Start Period","End Period",0,1,2,3,4,"Lookup","Lookup2","InterventionID",null,null,null,{"$f":"COUNTA(B:B)-15","v":0}]

{"sheet":"i_ReportFilters","index":17,"n_rows":99,"n_cols":35,"rows_kept":99,"cut":false,"hidden":false,"merged":[[38,1,39,1],[42,1,43,1],[19,3,20,4],[1,1,2,6],[11,3,11,4],[7,1,7,2],[11,5,11,6],[7,3,7,4]]}
[]
[null,"Reports Control Panel",null,null,null,null,null,null,null,null,null,null,null,null,null,null,null,null,"Report lookup:",{"$f":"IF(INDEX(OFFSET(StuLvlRpts,0,1),StudentReportNumber)=\"Yes\",INDEX($AD$5:$AD$10,StudentReportTime),\"\")&INDEX(StuLvlRpts,StudentReportNumber)","v":"GP1Custom report 1"},null,null,null,null,null,null,null,null,null,null,null,null,null,null,{"$f":"INDEX($AI$5:$AI$15,$D$9)","v":"All"}]
[null,null,null,null,null,null,null,null,null,null,null,null,null,null,null,null,null,null,"GP1Custom report 1",{"$f":"IF(INDEX(OFFSET(StuLvlRpts,0,1),StudentReportNumber)=\"Yes\",INDEX($AD$5:$AD$10,$C$13),\"\")&INDEX(StuLvlRpts,StudentReportNumber)","v":"GP1Custom report 1"},null,null,null,null,null,null,null,null,null,null,null,null,null,null,{"$f":"INDEX($AI$5:$AI$15,$F$13)","v":"All"}]
[null,null,null,null,null,null,null,null,null,null,null,null,null,null,null,null,"DescSize",{"$f":"INDEX($Q$5:$Q$20,StudentReportNumber)","v":17},"Student reports","time frame","extra calc","label1","label2","label3","denom","Description","Sum flags?",null,null,null,"Fields","School reports","sheet",null,"N/A"]
[null,null,null,null,null,null,null,null,null,null,null,null,null,null,null,null,34,null,"Flagged Student Report","Yes","Yes","Total Students:","Flagged Students:","% Flagged:",{"$f":"IF(StudentReportTime=5,SUMPRODUCT((EOY_status<>0)*(StudCohortReport=1)),IF(StudentReportTime>4,SUM(StudCohortReport),SUMPRODUCT((INDIRECT(INDEX($AH$5:$AH$8,StudentReportTime))<>0)*(StudCohortReport=1))))","v":1},"This report shows a list of students who are flagged for any indicators of risk and for which indicators they are flagged for the selected grading period or time frame.","Yes",1,{"$f":"i_Settings!B12","v":"Quarter 1"},"GP1","[Select a field name]","Risk Indicator Summary Report","o_IndSummary","ArrGP1_days","All"]
[null,null,null,null,null,null,null,null,null,null,null,null,null,null,null,null,34,"disability_flag","Flagged Student Report: Disabilities","Yes","Yes","Total Students With Disabilities:","Total Students With Disabilities Flagged:","% Students With Disabilities Flagged:",{"$f":"IF(StudentReportTime=5,SUMPRODUCT((Disability_flag=1)*(EOY_status<>0)*(StudCohortReport=1)),IF(StudentReportTime>4,SUMPRODUCT((Disability_flag=1)*(StudCohortReport=1)),SUMPRODUCT((Disability_flag=1)*(INDIRECT(INDEX($AH$5:$AH$8,StudentReportTime))<>0)*(StudCohortReport=1))))","v":0},"This report shows a list of students with disabilities who are flagged for any indicators of risk, for which indicators they are flagged, and their assigned interventions for the selected grading period or time frame.","Yes",2,{"$f":"i_Settings!B13","v":"Quarter 2"},"GP2",{"$f":"IF(OFFSET(FieldNames!$E2,0,GP_Type)=\"\",\"\",OFFSET(FieldNames!$E2,0,GP_Type))","v":"Last Name"},"Risk Indicator Summary Report: Disability Categories","o_IndDisability","ArrGP2_days",{"$f":"IF(i_Settings!G25=\"\",\"\",i_Settings!G25)","v":"Cohort A"}]
[null,null,null,null,null,null,null,null,null,null,null,null,null,null,null,null,34,"disadvantaged_flag","Flagged Student Report: Disadvantaged","Yes","Yes","Total Disadvantaged Students:","Total Disadvantaged Students Flagged:","% Disadvantaged Students Flagged:",{"$f":"IF(StudentReportTime=5,SUMPRODUCT((Disadvantaged_flag=1)*(EOY_status<>0)*(StudCohortReport=1)),IF(StudentReportTime>4,SUMPRODUCT((Disadvantaged_flag=1)*(StudCohortReport=1)),SUMPRODUCT((Disadvantaged_flag=1)*(INDIRECT(INDEX($AH$5:$AH$8,StudentReportTime))<>0)*(StudCohortReport=1))))","v":0},"This report shows a list of economically disadvantaged students (e.g., participate in the National School Lunch Program) who are flagged for any indicators of risk, for which indicators they are flagged, and their assigned interventions for the selected grading period or time frame.","Yes",3,{"$f":"i_Settings!B14","v":"Quarter 3"},"GP3",{"$f":"IF(OFFSET(FieldNames!$E3,0,GP_Type)=\"\",\"\",OFFSET(FieldNames!$E3,0,GP_Type))","v":"First Name"},"Risk Indicator Summary Report: Disadvantaged","o_IndDis","ArrGP3_days",{"$f":"IF(i_Settings!G26=\"\",\"\",i_Settings!G26)","v":"Cohort B"}]
[null,"School Level Reports:",null,"Cohort",null,null,null,null,null,null,null,null,null,null,null,null,34,"ELL_flag","Flagged Student Report: ELL","Yes","Yes","Total ELL Students:","Total ELL Students Flagged:","% ELL Students Flagged:",{"$f":"IF(StudentReportTime=5,SUMPRODUCT((ELL_flag=1)*(EOY_status<>0)*(StudCohortReport=1)),IF(StudentReportTime>4,SUMPRODUCT((ELL_flag=1)*(StudCohortReport=1)),SUMPRODUCT((ELL_flag=1)*(INDIRECT(INDEX($AH$5:$AH$8,StudentReportTime))<>0)*(StudCohortReport=1))))","v":0},"This report shows a list of students who are designated as English language learners who are flagged for any indicators of risk, for which indicators they are flagged, and their assigned interventions for the selected grading period or time frame.","Yes",4,{"$f":"i_Settings!B15","v":"Quarter 4"},"GP4",{"$f":"IF(OFFSET(FieldNames!$E4,0,GP_Type)=\"\",\"\",OFFSET(FieldNames!$E4,0,GP_Type))","v":"Student ID"},"Risk Indicator Summary Report: ELL","o_IndELL","ArrGP4_days",{"$f":"IF(i_Settings!G27=\"\",\"\",i_Settings!G27)","v":"Cohort C"}]
[null,9,null,1,null,null,null,null,null,null,null,null,null,null,null,null,17,null,"Incoming Indicator of Risk Report","No","No",null,null,null,null,"This report shows a list of students who were flagged with an incoming indicator of risk (if available).","Yes",5,"End of year","yr",{"$f":"IF(OFFSET(FieldNames!$E5,0,GP_Type)=\"\",\"\",OFFSET(FieldNames!$E5,0,GP_Type))","v":"Grade"},"Enrollment Status Summary Report","o_EnrollStatusSum",{"$f":"INDEX($R$5:$R$20,StudentReportNumber)","v":0},{"$f":"IF(i_Settings!G28=\"\",\"\",i_Settings!G28)","v":""}]
[null,null,null,null,null,null,null,null,null,null,null,null,null,null,null,null,85,null,"Off- to On-Track Report","Yes","No",null,null,null,null,"This report shows a list of students who ARE NOT flagged for any indicators of risk in the selected grading period, but who WERE flagged in the previous grading period. It also shows the interventions in which these students are participating during the selected grading period or time frame. Please refer to the 'More Info' button for additional information about this report.","Yes",6,"Full year","Full",{"$f":"IF(OFFSET(FieldNames!$E6,0,GP_Type)=\"\",\"\",OFFSET(FieldNames!$E6,0,GP_Type))","v":"Phone #"},"Intervention Summary Report: Program","o_SchIntSum",{"$f":"INDEX($R$5:$R$20,StudentReportNumber)","v":0},{"$f":"IF(i_Settings!G29=\"\",\"\",i_Settings!G29)","v":""}]
[null,null,null,null,null,null,null,null,null,null,null,null,null,null,null,null,85,null,"On- to Off-Track Report","Yes","No",null,null,null,null,"This report shows a list of students who ARE flagged for any indicators of risk in the selected grading period, but who WERE NOT flagged in the previous grading period. It also shows their assigned interventions during the selected grading period or time frame. Please refer to the 'More Info' button for additional information about this report.","Yes",null,null,null,{"$f":"IF(OFFSET(FieldNames!$E7,0,GP_Type)=\"\",\"\",OFFSET(FieldNames!$E7,0,GP_Type))","v":"Guardian(s)"},"Intervention Summary Report: Tiers","o_Tier_Int",null,{"$f":"IF(i_Settings!G30=\"\",\"\",i_Settings!G30)","v":""}]
[null,"Student Level Reports:","Time Frame:","Intervention:",null,"Cohort",null,null,null,null,null,null,null,null,null,null,34,null,"Flagged Student Intervention Report","Yes","Yes","Total Students:","Flagged Students:","% Flagged:",{"$f":"IF(StudentReportTime=5,SUMPRODUCT((EOY_status<>0)*(StudCohortReport=1)),IF(StudentReportTime>4,SUM(StudCohortReport),SUMPRODUCT((INDIRECT(\"ArrGP\"&StudentReportTime&\"_Days\")<>0)*(StudCohortReport=1))))","v":1},"This report shows a list of all students who are flagged for any indicators of risk, for which indicators they are flagged, and their assigned interventions for the selected grading period or time frame. ","Yes",null,null,null,{"$f":"IF(OFFSET(FieldNames!$E8,0,GP_Type)=\"\",\"\",OFFSET(FieldNames!$E8,0,GP_Type))","v":"Email"},"Intervention Summary Report: Type","o_SchIntSumType",null,{"$f":"IF(i_Settings!G31=\"\",\"\",i_Settings!G31)","v":""}]
[null,12,1,1,null,1,null,null,null,null,null,null,null,null,null,null,34,null,"Intervention Report","Yes","Yes","Total Students:","Students in Intervention:","% in Intervention:",{"$f":"IF(StudentReportTime=5,SUMPRODUCT((EOY_status<>0)*(StudCohortReport=1)),IF(StudentReportTime>4,SUM(StudCohortReport),SUMPRODUCT((INDIRECT(\"ArrGP\"&StudentReportTime&\"_Days\")<>0)*(StudCohortReport=1))))","v":1},"This report shows a list of students assigned to participate in the selected intervention program and the indicators of risk for which they are flagged during the selected grading period or time frame. Use the ‘Intervention’ drop-down menu to change the intervention program shown.","Yes",null,null,null,{"$f":"IF(OFFSET(FieldNames!$E9,0,GP_Type)=\"\",\"\",OFFSET(FieldNames!$E9,0,GP_Type))","v":"Date of Birth"},"Incoming Indicator of Risk Transition Report","o_SchSuccessRpt",null,{"$f":"IF(i_Settings!G32=\"\",\"\",i_Settings!G32)","v":""}]
[null,null,null,null,null,null,null,null,null,null,null,null,null,null,null,null,51,null,"Overage Student Report","No","No",null,null,null,null,"This report shows a list of students who are overage for their grade (based on the Kindergarten cutoff date entered in the Tool Setting). For each student, the report shows the indicators of risk for which they are flagged and their assigned interventions for each grading period.","Yes",null,null,null,{"$f":"IF(OFFSET(FieldNames!$E10,0,GP_Type)=\"\",\"\",OFFSET(FieldNames!$E10,0,GP_Type))","v":"Gender"},null,null,null,{"$f":"IF(i_Settings!G33=\"\",\"\",i_Settings!G33)","v":""}]
[null,null,null,null,null,null,null,null,null,null,null,null,null,null,null,null,51,null,"Student Dropout Report","Yes","No",null,null,null,null,"This report shows a list of students who dropped out of the middle grades during any point of the school year. It shows the date of their enrollment status change (i.e., when they dropped out), the indicators of risk for which they are flagged, and their assigned interventions for the selected grading period or time frame.  ","Yes",null,null,null,{"$f":"IF(OFFSET(FieldNames!$E11,0,GP_Type)=\"\",\"\",OFFSET(FieldNames!$E11,0,GP_Type))","v":"Ethnicity"},null,null,null,{"$f":"IF(i_Settings!G34=\"\",\"\",i_Settings!G34)","v":""}]
[null,null,null,null,null,null,null,null,null,null,null,null,null,null,null,null,17,null,"Custom report 1","Yes","No",null,null,null,null,"This report can be customized to include any data fields that you select in the Custom Reports menu.","Yes",null,null,null,{"$f":"IF(OFFSET(FieldNames!$E12,0,GP_Type)=\"\",\"\",OFFSET(FieldNames!$E12,0,GP_Type))","v":"Disability"}]
[null,null,null,null,null,null,null,null,null,null,null,null,null,null,null,null,17,null,"Custom report 2","Yes","No",null,null,null,null,"This report can be customized to include any data fields that you select in the Custom Reports menu.","Yes",null,null,null,{"$f":"IF(OFFSET(FieldNames!$E13,0,GP_Type)=\"\",\"\",OFFSET(FieldNames!$E13,0,GP_Type))","v":"Disadvantaged"}]
[null,"Advanced Settings",null,null,null,null,null,null,null,null,null,null,null,null,null,null,17,null,"Custom report 3","Yes","No",null,null,null,null,"This report can be customized to include any data fields that you select in the Custom Reports menu.","Yes",null,null,null,{"$f":"IF(OFFSET(FieldNames!$E14,0,GP_Type)=\"\",\"\",OFFSET(FieldNames!$E14,0,GP_Type))","v":"ELL Status"}]
[null,null,null,null,null,null,null,null,null,null,null,null,null,null,null,null,17,null,"Custom report 4","Yes","No",null,null,null,null,"This report can be customized to include any data fields that you select in the Custom Reports menu.","Yes",null,null,null,{"$f":"IF(OFFSET(FieldNames!$E15,0,GP_Type)=\"\",\"\",OFFSET(FieldNames!$E15,0,GP_Type))","v":"Cohort"}]
[{"$f":"IF(B25=$AE$5,$AE$5,INDEX(FieldNames!A:A,MATCH(B25,FieldNames!E:E,0)))","v":"[Select a field name]"},"Active Filters:",{"$f":"COUNTIF($C$23:$G$23,\">\"&0)","v":0},null,null,null,null,null,null,null,null,null,null,null,null,null,17,null,"Custom report 5","Yes","No",null,null,null,null,"This report can be customized to include any data fields that you select in the Custom Reports menu.","Yes",null,null,null,{"$f":"IF(OFFSET(FieldNames!$E16,0,GP_Type)=\"\",\"\",OFFSET(FieldNames!$E16,0,GP_Type))","v":"Enrollment Status"}]
[{"$f":"IF(B26=$AE$5,$AE$5,INDEX(FieldNames!A:A,MATCH(B26,FieldNames!E:E,0)))","v":"[Select a field name]"},"Students Matched:",{"$f":"COUNTA(c_ReportData!$DF:$DF)-1","v":1},null,null,true,null,null,null,null,null,null,null,null,null,null,51,null,"Incoming Indicator of Risk Transition Report","Yes","No",null,null,null,null,"This report shows a list of all students who were flagged for the pre-high school  indicator of risk and whether they are flagged for attendance and/or any academic indicators during the selected grading period or time frame. It also shows their assigned interventions during the selected grading period or time frame.","Yes",null,null,null,{"$f":"IF(OFFSET(FieldNames!$E17,0,GP_Type)=\"\",\"\",OFFSET(FieldNames!$E17,0,GP_Type))","v":"Date of Status Change"}]
[{"$f":"IF(B27=$AE$5,$AE$5,INDEX(FieldNames!A:A,MATCH(B27,FieldNames!E:E,0)))","v":"[Select a field name]"},null,null,null,null,null,null,null,null,null,null,null,null,null,null,null,null,null,null,null,null,null,null,null,null,null,null,null,null,null,{"$f":"IF(OFFSET(FieldNames!$E18,0,GP_Type)=\"\",\"\",OFFSET(FieldNames!$E18,0,GP_Type))","v":"Any Disability"}]
[{"$f":"IF(B28=$AE$5,$AE$5,INDEX(FieldNames!A:A,MATCH(B28,FieldNames!E:E,0)))","v":"[Select a field name]"},"Active Fields:",{"$f":"COUNTA(C$25:C$34)","v":0},{"$f":"COUNTA(D$25:D$34)","v":0},{"$f":"COUNTA(E$25:E$34)","v":0},{"$f":"COUNTA(F$25:F$34)","v":0},{"$f":"COUNTA(G$25:G$34)","v":0},null,null,null,null,null,null,null,null,null,null,null,null,null,null,null,null,null,null,null,null,null,null,null,{"$f":"IF(OFFSET(FieldNames!$E19,0,GP_Type)=\"\",\"\",OFFSET(FieldNames!$E19,0,GP_Type))","v":"Any ELL"}]
[{"$f":"IF(B29=$AE$5,$AE$5,INDEX(FieldNames!A:A,MATCH(B29,FieldNames!E:E,0)))","v":"[Select a field name]"},"Field","Filter 1","Filter 2","Filter 3","Filter 4","Filter 5",null,null,null,null,null,null,null,null,null,null,null,"Blank filter",null,null,null,null,null,null,null,null,null,null,null,{"$f":"IF(OFFSET(FieldNames!$E20,0,GP_Type)=\"\",\"\",OFFSET(FieldNames!$E20,0,GP_Type))","v":"Any Disadvantaged"}]
[{"$f":"IF(B30=$AE$5,$AE$5,INDEX(FieldNames!A:A,MATCH(B30,FieldNames!E:E,0)))","v":"[Select a field name]"},"[Select a field name]",null,null,null,null,null,null,null,null,null,null,null,null,null,null,null,null,"[Select a field name]",null,null,null,null,null,null,null,null,null,null,null,{"$f":"IF(OFFSET(FieldNames!$E21,0,GP_Type)=\"\",\"\",OFFSET(FieldNames!$E21,0,GP_Type))","v":"Any Characteristic"}]
[{"$f":"IF(B31=$AE$5,$AE$5,INDEX(FieldNames!A:A,MATCH(B31,FieldNames!E:E,0)))","v":"[Select a field name]"},"[Select a field name]",null,null,null,null,null,null,null,null,null,null,null,null,null,null,null,null,"[Select a field name]",null,null,null,null,null,null,null,null,null,null,null,{"$f":"IF(OFFSET(FieldNames!$E22,0,GP_Type)=\"\",\"\",OFFSET(FieldNames!$E22,0,GP_Type))","v":"Incoming Risk Indicator"}]
[{"$f":"IF(B32=$AE$5,$AE$5,INDEX(FieldNames!A:A,MATCH(B32,FieldNames!E:E,0)))","v":"[Select a field name]"},"[Select a field name]",null,null,null,null,null,null,null,null,null,null,null,null,null,null,null,null,"[Select a field name]",null,null,null,null,null,null,null,null,null,null,null,{"$f":"IF(OFFSET(FieldNames!$E23,0,GP_Type)=\"\",\"\",OFFSET(FieldNames!$E23,0,GP_Type))","v":"Exam Risk Indicator"}]
[{"$f":"IF(B33=$AE$5,$AE$5,INDEX(FieldNames!A:A,MATCH(B33,FieldNames!E:E,0)))","v":"[Select a field name]"},"[Select a field name]",null,null,null,null,null,null,null,null,null,null,null,null,null,null,null,null,"[Select a field name]",null,null,null,null,null,null,null,null,null,null,null,{"$f":"IF(OFFSET(FieldNames!$E24,0,GP_Type)=\"\",\"\",OFFSET(FieldNames!$E24,0,GP_Type))","v":"Quarter 1 First 20 Day Attendance Flag"}]
[{"$f":"IF(B34=$AE$5,$AE$5,INDEX(FieldNames!A:A,MATCH(B34,FieldNames!E:E,0)))","v":"[Select a field name]"},"[Select a field name]",null,null,null,null,null,null,null,null,null,null,null,null,null,null,null,null,"[Select a field name]",null,null,null,null,null,null,null,null,null,null,null,{"$f":"IF(OFFSET(FieldNames!$E25,0,GP_Type)=\"\",\"\",OFFSET(FieldNames!$E25,0,GP_Type))","v":"Quarter 1 Attendance Flag"}]
[null,"[Select a field name]",null,null,null,null,null,null,null,null,null,null,null,null,null,null,null,null,"[Select a field name]",null,null,null,null,null,null,null,null,null,null,null,{"$f":"IF(OFFSET(FieldNames!$E26,0,GP_Type)=\"\",\"\",OFFSET(FieldNames!$E26,0,GP_Type))","v":"Quarter 1 English Course Fail Flag"}]
[null,"[Select a field name]",null,null,null,null,null,null,null,null,null,null,null,null,null,null,null,null,"[Select a field name]",null,null,null,null,null,null,null,null,null,null,null,{"$f":"IF(OFFSET(FieldNames!$E27,0,GP_Type)=\"\",\"\",OFFSET(FieldNames!$E27,0,GP_Type))","v":"Quarter 1 Math Course Fail Flag"}]
[null,"[Select a field name]",null,null,null,null,null,null,null,null,null,null,null,null,null,null,null,null,"[Select a field name]",null,null,null,null,null,null,null,null,null,null,null,{"$f":"IF(OFFSET(FieldNames!$E28,0,GP_Type)=\"\",\"\",OFFSET(FieldNames!$E28,0,GP_Type))","v":"Quarter 1 Behavior Flag"}]
[null,"[Select a field name]",null,null,null,null,null,null,null,null,null,null,null,null,null,null,null,null,"[Select a field name]",null,null,null,null,null,null,null,null,null,null,null,{"$f":"IF(OFFSET(FieldNames!$E29,0,GP_Type)=\"\",\"\",OFFSET(FieldNames!$E29,0,GP_Type))","v":"Quarter 1 Any Flag"}]
[null,"[Select a field name]",null,null,null,null,null,null,null,null,null,null,null,null,null,null,null,null,"[Select a field name]",null,null,null,null,null,null,null,null,null,null,null,{"$f":"IF(OFFSET(FieldNames!$E30,0,GP_Type)=\"\",\"\",OFFSET(FieldNames!$E30,0,GP_Type))","v":"Quarter 1 Any Attendance Flag"}]
[null,null,null,null,null,null,null,null,null,null,null,null,null,null,null,null,null,null,null,null,null,null,null,null,null,null,null,null,null,null,{"$f":"IF(OFFSET(FieldNames!$E31,0,GP_Type)=\"\",\"\",OFFSET(FieldNames!$E31,0,GP_Type))","v":"Quarter 1 Any Academic Flag"}]
[null,null,null,null,null,null,null,null,null,null,null,null,null,null,null,null,null,null,null,null,null,null,null,null,null,null,null,null,null,null,{"$f":"IF(OFFSET(FieldNames!$E32,0,GP_Type)=\"\",\"\",OFFSET(FieldNames!$E32,0,GP_Type))","v":"Quarter 2 Attendance Flag"}]
[null,null,null,null,null,null,null,null,null,null,null,null,null,null,null,null,null,null,null,null,null,null,null,null,null,null,null,null,null,null,{"$f":"IF(OFFSET(FieldNames!$E33,0,GP_Type)=\"\",\"\",OFFSET(FieldNames!$E33,0,GP_Type))","v":"Quarter 2 English Course Fail Flag"}]
[null,null,null,null,null,null,null,null,null,null,null,null,null,null,null,null,null,null,null,null,null,null,null,null,null,null,null,null,null,null,{"$f":"IF(OFFSET(FieldNames!$E34,0,GP_Type)=\"\",\"\",OFFSET(FieldNames!$E34,0,GP_Type))","v":"Quarter 2 Math Course Fail Flag"}]
[null,"View Detailed Student Report:",null,null,null,null,null,null,null,null,null,null,null,null,null,null,null,null,null,null,null,null,null,null,null,null,null,null,null,null,{"$f":"IF(OFFSET(FieldNames!$E35,0,GP_Type)=\"\",\"\",OFFSET(FieldNames!$E35,0,GP_Type))","v":"Quarter 2 Behavior Flag"}]
[null,null,null,null,null,null,null,null,null,null,null,null,null,null,null,null,null,null,null,null,null,null,null,null,null,null,null,null,null,null,{"$f":"IF(OFFSET(FieldNames!$E36,0,GP_Type)=\"\",\"\",OFFSET(FieldNames!$E36,0,GP_Type))","v":"Quarter 2 Any Flag"}]
[null,null,null,null,null,null,null,null,null,null,null,null,null,null,null,null,null,null,null,null,null,null,null,null,null,null,null,null,null,null,{"$f":"IF(OFFSET(FieldNames!$E37,0,GP_Type)=\"\",\"\",OFFSET(FieldNames!$E37,0,GP_Type))","v":"Quarter 2 Any Academic Flag"}]
[null,null,null,null,null,null,null,null,null,null,null,null,null,null,null,null,null,null,null,null,null,null,null,null,null,null,null,null,null,null,{"$f":"IF(OFFSET(FieldNames!$E38,0,GP_Type)=\"\",\"\",OFFSET(FieldNames!$E38,0,GP_Type))","v":"Quarter 3 Attendance Flag"}]
[null,"View Student Level Intervention Summary Report:",null,null,null,null,null,null,null,null,null,null,null,null,null,null,null,null,null,null,null,null,null,null,null,null,null,null,null,null,{"$f":"IF(OFFSET(FieldNames!$E39,0,GP_Type)=\"\",\"\",OFFSET(FieldNames!$E39,0,GP_Type))","v":"Quarter 3 English Course Fail Flag"}]
[null,null,null,null,null,null,null,null,null,null,null,null,null,null,null,null,null,null,null,null,null,null,null,null,null,null,null,null,null,null,{"$f":"IF(OFFSET(FieldNames!$E40,0,GP_Type)=\"\",\"\",OFFSET(FieldNames!$E40,0,GP_Type))","v":"Quarter 3 Math Course Fail Flag"}]
[null,null,null,null,null,null,null,null,null,null,null,null,null,null,null,null,null,null,null,null,null,null,null,null,null,null,null,null,null,null,{"$f":"IF(OFFSET(FieldNames!$E41,0,GP_Type)=\"\",\"\",OFFSET(FieldNames!$E41,0,GP_Type))","v":"Quarter 3 Behavior Flag"}]
[null,null,null,null,null,null,null,null,null,null,null,null,null,null,null,null,null,null,null,null,null,null,null,null,null,null,null,null,null,null,{"$f":"IF(OFFSET(FieldNames!$E42,0,GP_Type)=\"\",\"\",OFFSET(FieldNames!$E42,0,GP_Type))","v":"Quarter 3 Any Flag"}]
[null,null,null,null,null,null,null,null,null,null,null,null,null,null,null,null,null,null,null,null,null,null,null,null,null,null,null,null,null,null,{"$f":"IF(OFFSET(FieldNames!$E43,0,GP_Type)=\"\",\"\",OFFSET(FieldNames!$E43,0,GP_Type))","v":"Quarter 3 Any Academic Flag"}]
[null,null,null,null,null,null,null,null,null,null,null,null,null,null,null,null,null,null,null,null,null,null,null,null,null,null,null,null,null,null,{"$f":"IF(OFFSET(FieldNames!$E44,0,GP_Type)=\"\",\"\",OFFSET(FieldNames!$E44,0,GP_Type))","v":"Quarter 4 Attendance Flag"}]
[null,null,null,null,null,null,null,null,null,null,null,null,null,null,null,null,null,null,null,null,null,null,null,null,null,null,null,null,null,null,{"$f":"IF(OFFSET(FieldNames!$E45,0,GP_Type)=\"\",\"\",OFFSET(FieldNames!$E45,0,GP_Type))","v":"Quarter 4 English Course Fail Flag"}]
[null,null,null,null,null,null,null,null,null,null,null,null,null,null,null,null,null,null,null,null,null,null,null,null,null,null,null,null,null,null,{"$f":"IF(OFFSET(FieldNames!$E46,0,GP_Type)=\"\",\"\",OFFSET(FieldNames!$E46,0,GP_Type))","v":"Quarter 4 Math Course Fail Flag"}]
[null,null,null,null,null,null,null,null,null,null,null,null,null,null,null,null,null,null,null,null,null,null,null,null,null,null,null,null,null,null,{"$f":"IF(OFFSET(FieldNames!$E47,0,GP_Type)=\"\",\"\",OFFSET(FieldNames!$E47,0,GP_Type))","v":"Quarter 4 Behavior Flag"}]
[null,null,null,null,null,null,null,null,null,null,null,null,null,null,null,null,null,null,null,null,null,null,null,null,null,null,null,null,null,null,{"$f":"IF(OFFSET(FieldNames!$E48,0,GP_Type)=\"\",\"\",OFFSET(FieldNames!$E48,0,GP_Type))","v":"Quarter 4 Any Flag"}]
[null,null,null,null,null,null,null,null,null,null,null,null,null,null,null,null,null,null,null,null,null,null,null,null,null,null,null,null,null,null,{"$f":"IF(OFFSET(FieldNames!$E49,0,GP_Type)=\"\",\"\",OFFSET(FieldNames!$E49,0,GP_Type))","v":"Quarter 4 Any Academic Flag"}]
[null,null,null,null,null,null,null,null,null,null,null,null,null,null,null,null,null,null,null,null,null,null,null,null,null,null,null,null,null,null,{"$f":"IF(OFFSET(FieldNames!$E50,0,GP_Type)=\"\",\"\",OFFSET(FieldNames!$E50,0,GP_Type))","v":"Any Flag"}]
[null,null,null,null,null,null,null,null,null,null,null,null,null,null,null,null,null,null,null,null,null,null,null,null,null,null,null,null,null,null,{"$f":"IF(OFFSET(FieldNames!$E51,0,GP_Type)=\"\",\"\",OFFSET(FieldNames!$E51,0,GP_Type))","v":"Any Attendance Flag"}]
[null,null,null,null,null,null,null,null,null,null,null,null,null,null,null,null,null,null,null,null,null,null,null,null,null,null,null,null,null,null,{"$f":"IF(OFFSET(FieldNames!$E52,0,GP_Type)=\"\",\"\",OFFSET(FieldNames!$E52,0,GP_Type))","v":"Any Academic Flag"}]
[null,null,null,null,null,null,null,null,null,null,null,null,null,null,null,null,null,null,null,null,null,null,null,null,null,null,null,null,null,null,{"$f":"IF(OFFSET(FieldNames!$E53,0,GP_Type)=\"\",\"\",OFFSET(FieldNames!$E53,0,GP_Type))","v":"Any Behavior Flag"}]
[null,null,null,null,null,null,null,null,null,null,null,null,null,null,null,null,null,null,null,null,null,null,null,null,null,null,null,null,null,null,{"$f":"IF(OFFSET(FieldNames!$E54,0,GP_Type)=\"\",\"\",OFFSET(FieldNames!$E54,0,GP_Type))","v":"End of Year Attendance Flag"}]
[null,null,null,null,null,null,null,null,null,null,null,null,null,null,null,null,null,null,null,null,null,null,null,null,null,null,null,null,null,null,{"$f":"IF(OFFSET(FieldNames!$E55,0,GP_Type)=\"\",\"\",OFFSET(FieldNames!$E55,0,GP_Type))","v":"End of Year English Course Fail Flag"}]
[null,null,null,null,null,null,null,null,null,null,null,null,null,null,null,null,null,null,null,null,null,null,null,null,null,null,null,null,null,null,{"$f":"IF(OFFSET(FieldNames!$E56,0,GP_Type)=\"\",\"\",OFFSET(FieldNames!$E56,0,GP_Type))","v":"End of Year Math Course Fail Flag"}]
[null,null,null,null,null,null,null,null,null,null,null,null,null,null,null,null,null,null,null,null,null,null,null,null,null,null,null,null,null,null,{"$f":"IF(OFFSET(FieldNames!$E57,0,GP_Type)=\"\",\"\",OFFSET(FieldNames!$E57,0,GP_Type))","v":"End of Year Behavior Flag"}]
[null,null,null,null,null,null,null,null,null,null,null,null,null,null,null,null,null,null,null,null,null,null,null,null,null,null,null,null,null,null,{"$f":"IF(OFFSET(FieldNames!$E58,0,GP_Type)=\"\",\"\",OFFSET(FieldNames!$E58,0,GP_Type))","v":"End of Year Any Flag"}]
[null,null,null,null,null,null,null,null,null,null,null,null,null,null,null,null,null,null,null,null,null,null,null,null,null,null,null,null,null,null,{"$f":"IF(OFFSET(FieldNames!$E59,0,GP_Type)=\"\",\"\",OFFSET(FieldNames!$E59,0,GP_Type))","v":"End of Year Any Academic Flag"}]
[null,null,null,null,null,null,null,null,null,null,null,null,null,null,null,null,null,null,null,null,null,null,null,null,null,null,null,null,null,null,{"$f":"IF(OFFSET(FieldNames!$E60,0,GP_Type)=\"\",\"\",OFFSET(FieldNames!$E60,0,GP_Type))","v":"Quarter 1 Both Attendance and Academic Flags"}]
[null,null,null,null,null,null,null,null,null,null,null,null,null,null,null,null,null,null,null,null,null,null,null,null,null,null,null,null,null,null,{"$f":"IF(OFFSET(FieldNames!$E61,0,GP_Type)=\"\",\"\",OFFSET(FieldNames!$E61,0,GP_Type))","v":"Quarter 2 Both Attendance and Academic Flags"}]
[null,null,null,null,null,null,null,null,null,null,null,null,null,null,null,null,null,null,null,null,null,null,null,null,null,null,null,null,null,null,{"$f":"IF(OFFSET(FieldNames!$E62,0,GP_Type)=\"\",\"\",OFFSET(FieldNames!$E62,0,GP_Type))","v":"Quarter 3 Both Attendance and Academic Flags"}]
[null,null,null,null,null,null,null,null,null,null,null,null,null,null,null,null,null,null,null,null,null,null,null,null,null,null,null,null,null,null,{"$f":"IF(OFFSET(FieldNames!$E63,0,GP_Type)=\"\",\"\",OFFSET(FieldNames!$E63,0,GP_Type))","v":"Quarter 4 Both Attendance and Academic Flags"}]
[null,null,null,null,null,null,null,null,null,null,null,null,null,null,null,null,null,null,null,null,null,null,null,null,null,null,null,null,null,null,{"$f":"IF(OFFSET(FieldNames!$E64,0,GP_Type)=\"\",\"\",OFFSET(FieldNames!$E64,0,GP_Type))","v":"End of Year Both Attendance and Academic Flags"}]
[null,null,null,null,null,null,null,null,null,null,null,null,null,null,null,null,null,null,null,null,null,null,null,null,null,null,null,null,null,null,{"$f":"IF(OFFSET(FieldNames!$E65,0,GP_Type)=\"\",\"\",OFFSET(FieldNames!$E65,0,GP_Type))","v":"Participated in Tier 1 Attendance Intervention"}]
[null,null,null,null,null,null,null,null,null,null,null,null,null,null,null,null,null,null,null,null,null,null,null,null,null,null,null,null,null,null,{"$f":"IF(OFFSET(FieldNames!$E66,0,GP_Type)=\"\",\"\",OFFSET(FieldNames!$E66,0,GP_Type))","v":"Participated in Tier 2 Attendance Intervention"}]
[null,null,null,null,null,null,null,null,null,null,null,null,null,null,null,null,null,null,null,null,null,null,null,null,null,null,null,null,null,null,{"$f":"IF(OFFSET(FieldNames!$E67,0,GP_Type)=\"\",\"\",OFFSET(FieldNames!$E67,0,GP_Type))","v":"Participated in Tier 3 Attendance Intervention"}]
[null,null,null,null,null,null,null,null,null,null,null,null,null,null,null,null,null,null,null,null,null,null,null,null,null,null,null,null,null,null,{"$f":"IF(OFFSET(FieldNames!$E68,0,GP_Type)=\"\",\"\",OFFSET(FieldNames!$E68,0,GP_Type))","v":"Participated in Tier 1 Behavior Intervention"}]
[null,null,null,null,null,null,null,null,null,null,null,null,null,null,null,null,null,null,null,null,null,null,null,null,null,null,null,null,null,null,{"$f":"IF(OFFSET(FieldNames!$E69,0,GP_Type)=\"\",\"\",OFFSET(FieldNames!$E69,0,GP_Type))","v":"Participated in Tier 2 Behavior Intervention"}]
[null,null,null,null,null,null,null,null,null,null,null,null,null,null,null,null,null,null,null,null,null,null,null,null,null,null,null,null,null,null,{"$f":"IF(OFFSET(FieldNames!$E70,0,GP_Type)=\"\",\"\",OFFSET(FieldNames!$E70,0,GP_Type))","v":"Participated in Tier 3 Behavior Intervention"}]
[null,null,null,null,null,null,null,null,null,null,null,null,null,null,null,null,null,null,null,null,null,null,null,null,null,null,null,null,null,null,{"$f":"IF(OFFSET(FieldNames!$E71,0,GP_Type)=\"\",\"\",OFFSET(FieldNames!$E71,0,GP_Type))","v":"Participated in Tier 1 Academic Intervention"}]
[null,null,null,null,null,null,null,null,null,null,null,null,null,null,null,null,null,null,null,null,null,null,null,null,null,null,null,null,null,null,{"$f":"IF(OFFSET(FieldNames!$E72,0,GP_Type)=\"\",\"\",OFFSET(FieldNames!$E72,0,GP_Type))","v":"Participated in Tier 2 Academic Intervention"}]
[null,null,null,null,null,null,null,null,null,null,null,null,null,null,null,null,null,null,null,null,null,null,null,null,null,null,null,null,null,null,{"$f":"IF(OFFSET(FieldNames!$E73,0,GP_Type)=\"\",\"\",OFFSET(FieldNames!$E73,0,GP_Type))","v":"Participated in Tier 3 Academic Intervention"}]
[null,null,null,null,null,null,null,null,null,null,null,null,null,null,null,null,null,null,null,null,null,null,null,null,null,null,null,null,null,null,{"$f":"IF(OFFSET(FieldNames!$E74,0,GP_Type)=\"\",\"\",OFFSET(FieldNames!$E74,0,GP_Type))","v":"Quarter 1 Interventions"}]
[null,null,null,null,null,null,null,null,null,null,null,null,null,null,null,null,null,null,null,null,null,null,null,null,null,null,null,null,null,null,{"$f":"IF(OFFSET(FieldNames!$E75,0,GP_Type)=\"\",\"\",OFFSET(FieldNames!$E75,0,GP_Type))","v":"Quarter 2 Interventions"}]
[null,null,null,null,null,null,null,null,null,null,null,null,null,null,null,null,null,null,null,null,null,null,null,null,null,null,null,null,null,null,{"$f":"IF(OFFSET(FieldNames!$E76,0,GP_Type)=\"\",\"\",OFFSET(FieldNames!$E76,0,GP_Type))","v":"Quarter 3 Interventions"}]
[null,null,null,null,null,null,null,null,null,null,null,null,null,null,null,null,null,null,null,null,null,null,null,null,null,null,null,null,null,null,{"$f":"IF(OFFSET(FieldNames!$E77,0,GP_Type)=\"\",\"\",OFFSET(FieldNames!$E77,0,GP_Type))","v":"Quarter 4 Interventions"}]
[null,null,null,null,null,null,null,null,null,null,null,null,null,null,null,null,null,null,null,null,null,null,null,null,null,null,null,null,null,null,{"$f":"IF(OFFSET(FieldNames!$E78,0,GP_Type)=\"\",\"\",OFFSET(FieldNames!$E78,0,GP_Type))","v":"All Interventions"}]
[null,null,null,null,null,null,null,null,null,null,null,null,null,null,null,null,null,null,null,null,null,null,null,null,null,null,null,null,null,null,{"$f":"IF(OFFSET(FieldNames!$E79,0,GP_Type)=\"\",\"\",OFFSET(FieldNames!$E79,0,GP_Type))","v":"Student is Overage"}]
[null,null,null,null,null,null,null,null,null,null,null,null,null,null,null,null,null,null,null,null,null,null,null,null,null,null,null,null,null,null,{"$f":"IF(OFFSET(FieldNames!$E80,0,GP_Type)=\"\",\"\",OFFSET(FieldNames!$E80,0,GP_Type))","v":""}]
[null,null,null,null,null,null,null,null,null,null,null,null,null,null,null,null,null,null,null,null,null,null,null,null,null,null,null,null,null,null,{"$f":"IF(OFFSET(FieldNames!$E81,0,GP_Type)=\"\",\"\",OFFSET(FieldNames!$E81,0,GP_Type))","v":""}]
[null,null,null,null,null,null,null,null,null,null,null,null,null,null,null,null,null,null,null,null,null,null,null,null,null,null,null,null,null,null,{"$f":"IF(OFFSET(FieldNames!$E82,0,GP_Type)=\"\",\"\",OFFSET(FieldNames!$E82,0,GP_Type))","v":""}]
[null,null,null,null,null,null,null,null,null,null,null,null,null,null,null,null,null,null,null,null,null,null,null,null,null,null,null,null,null,null,{"$f":"IF(OFFSET(FieldNames!$E83,0,GP_Type)=\"\",\"\",OFFSET(FieldNames!$E83,0,GP_Type))","v":""}]
[null,null,null,null,null,null,null,null,null,null,null,null,null,null,null,null,null,null,null,null,null,null,null,null,null,null,null,null,null,null,{"$f":"IF(OFFSET(FieldNames!$E84,0,GP_Type)=\"\",\"\",OFFSET(FieldNames!$E84,0,GP_Type))","v":""}]
[null,null,null,null,null,null,null,null,null,null,null,null,null,null,null,null,null,null,null,null,null,null,null,null,null,null,null,null,null,null,{"$f":"IF(OFFSET(FieldNames!$E85,0,GP_Type)=\"\",\"\",OFFSET(FieldNames!$E85,0,GP_Type))","v":""}]
[null,null,null,null,null,null,null,null,null,null,null,null,null,null,null,null,null,null,null,null,null,null,null,null,null,null,null,null,null,null,{"$f":"IF(OFFSET(FieldNames!$E86,0,GP_Type)=\"\",\"\",OFFSET(FieldNames!$E86,0,GP_Type))","v":""}]
[null,null,null,null,null,null,null,null,null,null,null,null,null,null,null,null,null,null,null,null,null,null,null,null,null,null,null,null,null,null,{"$f":"IF(OFFSET(FieldNames!$E87,0,GP_Type)=\"\",\"\",OFFSET(FieldNames!$E87,0,GP_Type))","v":""}]
[null,null,null,null,null,null,null,null,null,null,null,null,null,null,null,null,null,null,null,null,null,null,null,null,null,null,null,null,null,null,{"$f":"IF(OFFSET(FieldNames!$E88,0,GP_Type)=\"\",\"\",OFFSET(FieldNames!$E88,0,GP_Type))","v":""}]
[null,null,null,null,null,null,null,null,null,null,null,null,null,null,null,null,null,null,null,null,null,null,null,null,null,null,null,null,null,null,{"$f":"IF(OFFSET(FieldNames!$E89,0,GP_Type)=\"\",\"\",OFFSET(FieldNames!$E89,0,GP_Type))","v":""}]
[null,null,null,null,null,null,null,null,null,null,null,null,null,null,null,null,null,null,null,null,null,null,null,null,null,null,null,null,null,null,{"$f":"IF(OFFSET(FieldNames!$E90,0,GP_Type)=\"\",\"\",OFFSET(FieldNames!$E90,0,GP_Type))","v":""}]
[null,null,null,null,null,null,null,null,null,null,null,null,null,null,null,null,null,null,null,null,null,null,null,null,null,null,null,null,null,null,{"$f":"IF(OFFSET(FieldNames!$E91,0,GP_Type)=\"\",\"\",OFFSET(FieldNames!$E91,0,GP_Type))","v":""}]
[null,null,null,null,null,null,null,null,null,null,null,null,null,null,null,null,null,null,null,null,null,null,null,null,null,null,null,null,null,null,{"$f":"IF(OFFSET(FieldNames!$E92,0,GP_Type)=\"\",\"\",OFFSET(FieldNames!$E92,0,GP_Type))","v":""}]
[null,null,null,null,null,null,null,null,null,null,null,null,null,null,null,null,null,null,null,null,null,null,null,null,null,null,null,null,null,null,{"$f":"IF(OFFSET(FieldNames!$E93,0,GP_Type)=\"\",\"\",OFFSET(FieldNames!$E93,0,GP_Type))","v":""}]
[null,null,null,null,null,null,null,null,null,null,null,null,null,null,null,null,null,null,null,null,null,null,null,null,null,null,null,null,null,null,{"$f":"IF(OFFSET(FieldNames!$E94,0,GP_Type)=\"\",\"\",OFFSET(FieldNames!$E94,0,GP_Type))","v":""}]
[null,null,null,null,null,null,null,null,null,null,null,null,null,null,null,null,null,null,null,null,null,null,null,null,null,null,null,null,null,null,{"$f":"IF(OFFSET(FieldNames!$E95,0,GP_Type)=\"\",\"\",OFFSET(FieldNames!$E95,0,GP_Type))","v":""}]

{"sheet":"i_StudentReportFields","index":18,"n_rows":124,"n_cols":29,"rows_kept":124,"cut":false,"hidden":true,"merged":[]}
[{"$f":"MATCH(ReportLookup,B:B,0)","v":91},"Report","F1","F2","F3","F4","F5","F6","F7","F8","F9","F10","F11","F12","F13","F14","F15","F16","F17","F18","F19","F20","F21","F22","F23","F24","F25","F26","F27"]
[null,"Incoming Indicator of Risk Report","Student ID","First Name","Last Name","Pre-HS indicator"]
[null,"GP1Flagged student report","Student ID","First Name","Last Name","Pre-HS indicator",{"$f":"\"GP1_First \"&EarlyAtt&\" Day Attendance\"","v":"GP1_First 20 Day Attendance"},"GP1_Attendance","GP1_EngCourseFail","GP1_MathCourseFail","GP1_Behavior"]
[null,"GP2Flagged student report","Student ID","First Name","Last Name","GP2_Attendance","GP2_EngCourseFail","GP2_MathCourseFail","GP2_Behavior"]
[null,"GP3Flagged student report","Student ID","First Name","Last Name","GP3_Attendance","GP3_EngCourseFail","GP3_MathCourseFail","GP3_Behavior"]
[null,"GP4Flagged student report","Student ID","First Name","Last Name","GP4_Attendance","GP4_EngCourseFail","GP4_MathCourseFail","GP4_Behavior"]
[null,"yrFlagged student report","Student ID","First Name","Last Name","eoy_Attendance","eoy_EngCourseFail","eoy_MathCourseFail","eoy_Behavior"]
[null,"GP1Flagged student report: Academics","Student ID","First Name","Last Name","Pre-HS indicator","GP1_EngCourseFail","GP1_MathCourseFail",{"$f":"\"GP1_First \"&EarlyAtt&\" Day Attendance\"","v":"GP1_First 20 Day Attendance"},"GP1_Attendance","GP1_Behavior"]
[null,"GP2Flagged student report: Academics","Student ID","First Name","Last Name","Pre-HS indicator","GP2_EngCourseFail","GP2_MathCourseFail","GP2_Attendance","GP2_Behavior"]
[null,"GP3Flagged student report: Academics","Student ID","First Name","Last Name","Pre-HS indicator","GP3_EngCourseFail","GP3_MathCourseFail","GP3_Attendance","GP3_Behavior"]
[null,"GP4Flagged student report: Academics","Student ID","First Name","Last Name","Pre-HS indicator","GP4_EngCourseFail","GP4_MathCourseFail","GP4_Attendance","GP4_Behavior"]
[null,"yrFlagged student report: Academics","Student ID","First Name","Last Name","Pre-HS indicator","eoy_EngCourseFail","eoy_MathCourseFail","eoy_Attendance","eoy_Behavior"]
[null,"GP1Flagged student report: Attendance","Student ID","First Name","Last Name","Pre-HS indicator",{"$f":"\"GP1_First \"&EarlyAtt&\" Day Attendance\"","v":"GP1_First 20 Day Attendance"},"GP1_Attendance","GP1_EngCourseFail","GP1_MathCourseFail","GP1_Behavior"]
[null,"GP2Flagged student report: Attendance","Student ID","First Name","Last Name","Pre-HS indicator","GP2_Attendance","GP2_EngCourseFail","GP2_MathCourseFail","GP2_Behavior"]
[null,"GP3Flagged student report: Attendance","Student ID","First Name","Last Name","Pre-HS indicator","GP3_Attendance","GP3_EngCourseFail","GP3_MathCourseFail","GP3_Behavior"]
[null,"GP4Flagged student report: Attendance","Student ID","First Name","Last Name","Pre-HS indicator","GP4_Attendance","GP4_EngCourseFail","GP4_MathCourseFail","GP4_Behavior"]
[null,"yrFlagged student report: Attendance","Student ID","First Name","Last Name","Pre-HS indicator","eoy_Attendance","eoy_EngCourseFail","eoy_MathCourseFail","eoy_Behavior"]
[null,"Off-track for graduation","Student ID","First Name","Last Name","Pre-HS indicator"]
[null,"GP1Flagged Student Report: Disabilities","Student ID","First Name","Last Name","Disability",{"$f":"\"GP1_First \"&EarlyAtt&\" Day Attendance\"","v":"GP1_First 20 Day Attendance"},"GP1_Attendance","GP1_EngCourseFail","GP1_MathCourseFail","GP1_Behavior","GP1 Interventions"]
[null,"GP2Flagged Student Report: Disabilities","Student ID","First Name","Last Name","Disability","GP2_Attendance","GP2_EngCourseFail","GP2_MathCourseFail","GP2_Behavior","GP2 Interventions"]
[null,"GP3Flagged Student Report: Disabilities","Student ID","First Name","Last Name","Disability","GP3_Attendance","GP3_EngCourseFail","GP3_MathCourseFail","GP3_Behavior","GP3 Interventions"]
[null,"GP4Flagged Student Report: Disabilities","Student ID","First Name","Last Name","Disability","GP4_Attendance","GP4_EngCourseFail","GP4_MathCourseFail","GP4_Behavior","GP4 Interventions"]
[null,"yrFlagged Student Report: Disabilities","Student ID","First Name","Last Name","Disability","eoy_Attendance","eoy_EngCourseFail","eoy_MathCourseFail","eoy_Behavior","GP1 Interventions","GP2 Interventions",{"$f":"IF(GP_Type>2,\"\",\"GP3 Interventions\")","v":"GP3 Interventions"},{"$f":"IF(GP_Type>1,\"\",\"GP4 Interventions\")","v":"GP4 Interventions"}]
[null,"GP1Flagged Student Report: ELL","Student ID","First Name","Last Name","ELL status",{"$f":"\"GP1_First \"&EarlyAtt&\" Day Attendance\"","v":"GP1_First 20 Day Attendance"},"GP1_Attendance","GP1_EngCourseFail","GP1_MathCourseFail","GP1_Behavior","GP1 Interventions"]
[null,"GP2Flagged Student Report: ELL","Student ID","First Name","Last Name","ELL status","GP2_Attendance","GP2_EngCourseFail","GP2_MathCourseFail","GP2_Behavior","GP2 Interventions"]
[null,"GP3Flagged Student Report: ELL","Student ID","First Name","Last Name","ELL status","GP3_Attendance","GP3_EngCourseFail","GP3_MathCourseFail","GP3_Behavior","GP3 Interventions"]
[null,"GP4Flagged Student Report: ELL","Student ID","First Name","Last Name","ELL status","GP4_Attendance","GP4_EngCourseFail","GP4_MathCourseFail","GP4_Behavior","GP4 Interventions"]
[null,"yrFlagged Student Report: ELL","Student ID","First Name","Last Name","ELL status","eoy_Attendance","eoy_EngCourseFail","eoy_MathCourseFail","eoy_Behavior","GP1 Interventions","GP2 Interventions",{"$f":"IF(GP_Type>2,\"\",\"GP3 Interventions\")","v":"GP3 Interventions"},{"$f":"IF(GP_Type>1,\"\",\"GP4 Interventions\")","v":"GP4 Interventions"}]
[null,"GP1Flagged Student Report: Disadvantaged","Student ID","First Name","Last Name","Disadvantaged",{"$f":"\"GP1_First \"&EarlyAtt&\" Day Attendance\"","v":"GP1_First 20 Day Attendance"},"GP1_Attendance","GP1_EngCourseFail","GP1_MathCourseFail","GP1_Behavior","GP1 Interventions"]
[null,"GP2Flagged Student Report: Disadvantaged","Student ID","First Name","Last Name","Disadvantaged","GP2_Attendance","GP2_EngCourseFail","GP2_MathCourseFail","GP2_Behavior","GP2 Interventions"]
[null,"GP3Flagged Student Report: Disadvantaged","Student ID","First Name","Last Name","Disadvantaged","GP3_Attendance","GP3_EngCourseFail","GP3_MathCourseFail","GP3_Behavior","GP3 Interventions"]
[null,"GP4Flagged Student Report: Disadvantaged","Student ID","First Name","Last Name","Disadvantaged","GP4_Attendance","GP4_EngCourseFail","GP4_MathCourseFail","GP4_Behavior","GP4 Interventions"]
[null,"yrFlagged Student Report: Disadvantaged","Student ID","First Name","Last Name","Disadvantaged","eoy_Attendance","eoy_EngCourseFail","eoy_MathCourseFail","eoy_Behavior","GP1 Interventions","GP2 Interventions",{"$f":"IF(GP_Type>2,\"\",\"GP3 Interventions\")","v":"GP3 Interventions"},{"$f":"IF(GP_Type>1,\"\",\"GP4 Interventions\")","v":"GP4 Interventions"}]
[null,"GP1Intervention report","Student ID","First Name","Last Name",{"$f":"\"GP1_First \"&EarlyAtt&\" Day Attendance\"","v":"GP1_First 20 Day Attendance"},"GP1_Attendance","GP1_EngCourseFail","GP1_MathCourseFail","GP1_Behavior","GP1_Int flag"]
[null,"GP2Intervention report","Student ID","First Name","Last Name","GP2_Attendance","GP2_EngCourseFail","GP2_MathCourseFail","GP2_Behavior","GP2_Int flag"]
[null,"GP3Intervention report","Student ID","First Name","Last Name","GP3_Attendance","GP3_EngCourseFail","GP3_MathCourseFail","GP3_Behavior","GP3_Int flag"]
[null,"GP4Intervention report","Student ID","First Name","Last Name","GP4_Attendance","GP4_EngCourseFail","GP4_MathCourseFail","GP4_Behavior","GP4_Int flag"]
[null,"yrIntervention report","Student ID","First Name","Last Name","eoy_Attendance","eoy_EngCourseFail","eoy_MathCourseFail","eoy_Behavior","GP1_Int flag","GP2_Int flag",{"$f":"IF(GP_Type>2,\"\",\"GP3_Int flag\")","v":"GP3_Int flag"},{"$f":"IF(GP_Type>1,\"\",\"GP4_Int flag\")","v":"GP4_Int flag"}]
[null,"Pre-high school interventions report","Student ID","First Name","Last Name","Pre-HS indicator","Pre-HS Interventions"]
[null,"Overage Student Report",{"$f":"INDEX(C$122:C$124,GP_Type)","v":"Student ID"},"First Name","Last Name","GP1_Any att","GP1_Any acad","GP1_Behavior","GP1 Interventions","GP2_Attendance","GP2_Any acad","GP2_Behavior",{"$f":"INDEX(M$122:M$124,GP_Type)","v":"GP2 Interventions"},"GP3_Attendance","GP3_Any acad","GP3_Behavior","GP3 Interventions","GP4_Attendance",{"$f":"INDEX(S$122:S$124,GP_Type)","v":"GP4_Any acad"},"GP4_Behavior","GP4 Interventions","eoy_Attendance","eoy_Any acad","eoy_Behavior"]
[null,"GP1Student Dropout Report","Student ID","First Name","Last Name","Enrollment status","Date of Status Change","GP1_Any att","GP1_Any acad","GP1_Behavior","GP1 Interventions"]
[null,"GP2Student Dropout Report","Student ID","First Name","Last Name","Enrollment status","Date of Status Change","GP2_Attendance","GP2_Any acad","GP2_Behavior","GP2 Interventions"]
[null,"GP3Student Dropout Report","Student ID","First Name","Last Name","Enrollment status","Date of Status Change","GP3_Attendance","GP3_Any acad","GP3_Behavior","GP3 Interventions"]
[null,"GP4Student Dropout Report","Student ID","First Name","Last Name","Enrollment status","Date of Status Change","GP4_Attendance","GP4_Any acad","GP4_Behavior","GP4 Interventions"]
[null,"yrStudent Dropout Report","Student ID","First Name","Last Name","Enrollment status","Date of Status Change","eoy_Attendance","eoy_Any acad","eoy_Behavior","GP1 Interventions","GP2 Interventions",{"$f":"IF(GP_Type>2,\"\",\"GP3 Interventions\")","v":"GP3 Interventions"},{"$f":"IF(GP_Type>1,\"\",\"GP4 Interventions\")","v":"GP4 Interventions"}]
[null,"GP1Student transfers","Student ID","First Name","Last Name","Enrollment status","Date of Status Change","GP1_Any att","GP1_Any acad","GP1_Behavior"]
[null,"GP2Student transfers","Student ID","First Name","Last Name","Enrollment status","Date of Status Change","GP2_Attendance","GP2_Any acad","GP2_Behavior"]
[null,"GP3Student transfers","Student ID","First Name","Last Name","Enrollment status","Date of Status Change","GP3_Attendance","GP3_Any acad","GP3_Behavior"]
[null,"GP4Student transfers","Student ID","First Name","Last Name","Enrollment status","Date of Status Change","GP4_Attendance","GP4_Any acad","GP4_Behavior"]
[null,"yrStudent transfers","Student ID","First Name","Last Name","Enrollment status","Date of Status Change","eoy_Attendance","eoy_Any acad","eoy_Behavior"]
[null,"GP1Incoming Indicator of Risk Transition Report","Student ID","First Name","Last Name","Pre-HS indicator","GP1_Any att","GP1_Any acad","GP1_Behavior","GP1 Interventions"]
[null,"GP2Incoming Indicator of Risk Transition Report","Student ID","First Name","Last Name","Pre-HS indicator","GP2_Attendance","GP2_Any acad","GP2_Behavior","GP2 Interventions"]
[null,"GP3Incoming Indicator of Risk Transition Report","Student ID","First Name","Last Name","Pre-HS indicator","GP3_Attendance","GP3_Any acad","GP3_Behavior","GP3 Interventions"]
[null,"GP4Incoming Indicator of Risk Transition Report","Student ID","First Name","Last Name","Pre-HS indicator","GP4_Attendance","GP4_Any acad","GP4_Behavior","GP4 Interventions"]
[null,"yrIncoming Indicator of Risk Transition Report","Student ID","First Name","Last Name","Pre-HS indicator","eoy_Attendance","eoy_Any acad","eoy_Behavior","GP1 Interventions","GP2 Interventions",{"$f":"IF(GP_Type>2,\"\",\"GP3 Interventions\")","v":"GP3 Interventions"},{"$f":"IF(GP_Type>1,\"\",\"GP4 Interventions\")","v":"GP4 Interventions"}]
[null,"GP1On- to off-track report","Student ID","First Name","Last Name","Pre-HS indicator","GP1_Any att","GP1_Any acad","GP1_Behavior","GP1 Interventions"]
[null,"GP2On- to off-track report","Student ID","First Name","Last Name","GP1_Any att","GP1_Any acad","GP1_Behavior","GP2_Attendance","GP2_Any acad","GP2_Behavior","GP2 Interventions"]
[null,"GP3On- to off-track report","Student ID","First Name","Last Name","GP2_Attendance","GP2_Any acad","GP2_Behavior","GP3_Attendance","GP3_Any acad","GP3_Behavior","GP3 Interventions"]
[null,"GP4On- to off-track report","Student ID","First Name","Last Name","GP3_Attendance","GP3_Any acad","GP3_Behavior","GP4_Attendance","GP4_Any acad","GP4_Behavior","GP4 Interventions"]
[null,"yrOn- to off-track report","Student ID","First Name","Last Name",{"$f":"\"GP\"&IF(GP_Type=1,\"4\",IF(GP_Type=2,\"3\",\"2\"))&\"_Attendance\"","v":"GP4_Attendance"},{"$f":"\"GP\"&IF(GP_Type=1,\"4\",IF(GP_Type=2,\"3\",\"2\"))&\"_Any acad\"","v":"GP4_Any acad"},{"$f":"\"GP\"&IF(GP_Type=1,\"4\",IF(GP_Type=2,\"3\",\"2\"))&\"_Behavior\"","v":"GP4_Behavior"},"eoy_Attendance","eoy_Any acad","eoy_Behavior","GP1 Interventions","GP2 Interventions",{"$f":"IF(GP_Type>2,\"\",\"GP3 Interventions\")","v":"GP3 Interventions"},{"$f":"IF(GP_Type>1,\"\",\"GP4 Interventions\")","v":"GP4 Interventions"}]
[null,"GP1Off- to on-track report","Student ID","First Name","Last Name","Pre-HS indicator","GP1_Any att","GP1_Any acad","GP1_Behavior","GP1 Interventions"]
[null,"GP2Off- to on-track report","Student ID","First Name","Last Name","GP1_Any att","GP1_Any acad","GP1_Behavior","GP2_Attendance","GP2_Any acad","GP2_Behavior","GP2 Interventions"]
[null,"GP3Off- to on-track report","Student ID","First Name","Last Name","GP2_Attendance","GP2_Any acad","GP2_Behavior","GP3_Attendance","GP3_Any acad","GP3_Behavior","GP3 Interventions"]
[null,"GP4Off- to on-track report","Student ID","First Name","Last Name","GP3_Attendance","GP3_Any acad","GP3_Behavior","GP4_Attendance","GP4_Any acad","GP4_Behavior","GP4 Interventions"]
[null,"yrOff- to on-track report","Student ID","First Name","Last Name",{"$f":"\"GP\"&IF(GP_Type=1,\"4\",IF(GP_Type=2,\"3\",\"2\"))&\"_Attendance\"","v":"GP4_Attendance"},{"$f":"\"GP\"&IF(GP_Type=1,\"4\",IF(GP_Type=2,\"3\",\"2\"))&\"_Any acad\"","v":"GP4_Any acad"},{"$f":"\"GP\"&IF(GP_Type=1,\"4\",IF(GP_Type=2,\"3\",\"2\"))&\"_Behavior\"","v":"GP4_Behavior"},"eoy_Attendance","eoy_Any acad","eoy_Behavior","GP1 Interventions","GP2 Interventions",{"$f":"IF(GP_Type>2,\"\",\"GP3 Interventions\")","v":"GP3 Interventions"},{"$f":"IF(GP_Type>1,\"\",\"GP4 Interventions\")","v":"GP4 Interventions"}]
[null,"GP1Flagged student intervention report","Student ID","First Name","Last Name","Pre-HS indicator",{"$f":"\"GP1_First \"&EarlyAtt&\" Day Attendance\"","v":"GP1_First 20 Day Attendance"},"GP1_Attendance","GP1_EngCourseFail","GP1_MathCourseFail","GP1_Behavior","GP1 Interventions"]
[null,"GP2Flagged student intervention report","Student ID","First Name","Last Name","GP2_Attendance","GP2_EngCourseFail","GP2_MathCourseFail","GP2_Behavior","GP2 Interventions"]
[null,"GP3Flagged student intervention report","Student ID","First Name","Last Name","GP3_Attendance","GP3_EngCourseFail","GP3_MathCourseFail","GP3_Behavior","GP3 Interventions"]
[null,"GP4Flagged student intervention report","Student ID","First Name","Last Name","GP4_Attendance","GP4_EngCourseFail","GP4_MathCourseFail","GP4_Behavior","GP4 Interventions"]
[null,"yrFlagged student intervention report","Student ID","First Name","Last Name","eoy_Attendance","eoy_EngCourseFail","eoy_MathCourseFail","eoy_Behavior","GP1 Interventions","GP2 Interventions",{"$f":"IF(GP_Type>2,\"\",\"GP3 Interventions\")","v":"GP3 Interventions"},{"$f":"IF(GP_Type>1,\"\",\"GP4 Interventions\")","v":"GP4 Interventions"}]
[]
[]
[]
[]
[null,"FullFlagged student report","Student ID","First Name","Last Name",{"$f":"IF(INDEX(i_FullYearReportDefs!C:C,MATCH($B75,i_FullYearReportDefs!$B:$B,0)+i_Settings!$C$9-1)=\"\",\"\",INDEX(i_FullYearReportDefs!C:C,MATCH($B75,i_FullYearReportDefs!$B:$B,0)+i_Settings!$C$9-1))","v":"Pre-HS indicator"},{"$f":"IF(INDEX(i_FullYearReportDefs!D:D,MATCH($B75,i_FullYearReportDefs!$B:$B,0)+i_Settings!$C$9-1)=\"\",\"\",INDEX(i_FullYearReportDefs!D:D,MATCH($B75,i_FullYearReportDefs!$B:$B,0)+i_Settings!$C$9-1))","v":"GP1_First 20 Day Attendance"},{"$f":"IF(INDEX(i_FullYearReportDefs!E:E,MATCH($B75,i_FullYearReportDefs!$B:$B,0)+i_Settings!$C$9-1)=\"\",\"\",INDEX(i_FullYearReportDefs!E:E,MATCH($B75,i_FullYearReportDefs!$B:$B,0)+i_Settings!$C$9-1))","v":"GP1_Attendance"},{"$f":"IF(INDEX(i_FullYearReportDefs!F:F,MATCH($B75,i_FullYearReportDefs!$B:$B,0)+i_Settings!$C$9-1)=\"\",\"\",INDEX(i_FullYearReportDefs!F:F,MATCH($B75,i_FullYearReportDefs!$B:$B,0)+i_Settings!$C$9-1))","v":"GP1_EngCourseFail"},{"$f":"IF(INDEX(i_FullYearReportDefs!G:G,MATCH($B75,i_FullYearReportDefs!$B:$B,0)+i_Settings!$C$9-1)=\"\",\"\",INDEX(i_FullYearReportDefs!G:G,MATCH($B75,i_FullYearReportDefs!$B:$B,0)+i_Settings!$C$9-1))","v":"GP1_MathCourseFail"},{"$f":"IF(INDEX(i_FullYearReportDefs!H:H,MATCH($B75,i_FullYearReportDefs!$B:$B,0)+i_Settings!$C$9-1)=\"\",\"\",INDEX(i_FullYearReportDefs!H:H,MATCH($B75,i_FullYearReportDefs!$B:$B,0)+i_Settings!$C$9-1))","v":"GP1_Behavior"},{"$f":"IF(INDEX(i_FullYearReportDefs!I:I,MATCH($B75,i_FullYearReportDefs!$B:$B,0)+i_Settings!$C$9-1)=\"\",\"\",INDEX(i_FullYearReportDefs!I:I,MATCH($B75,i_FullYearReportDefs!$B:$B,0)+i_Settings!$C$9-1))","v":"GP2_Attendance"},{"$f":"IF(INDEX(i_FullYearReportDefs!J:J,MATCH($B75,i_FullYearReportDefs!$B:$B,0)+i_Settings!$C$9-1)=\"\",\"\",INDEX(i_FullYearReportDefs!J:J,MATCH($B75,i_FullYearReportDefs!$B:$B,0)+i_Settings!$C$9-1))","v":"GP2_EngCourseFail"},{"$f":"IF(INDEX(i_FullYearReportDefs!K:K,MATCH($B75,i_FullYearReportDefs!$B:$B,0)+i_Settings!$C$9-1)=\"\",\"\",INDEX(i_FullYearReportDefs!K:K,MATCH($B75,i_FullYearReportDefs!$B:$B,0)+i_Settings!$C$9-1))","v":"GP2_MathCourseFail"},{"$f":"IF(INDEX(i_FullYearReportDefs!L:L,MATCH($B75,i_FullYearReportDefs!$B:$B,0)+i_Settings!$C$9-1)=\"\",\"\",INDEX(i_FullYearReportDefs!L:L,MATCH($B75,i_FullYearReportDefs!$B:$B,0)+i_Settings!$C$9-1))","v":"GP2_Behavior"},{"$f":"IF(INDEX(i_FullYearReportDefs!M:M,MATCH($B75,i_FullYearReportDefs!$B:$B,0)+i_Settings!$C$9-1)=\"\",\"\",INDEX(i_FullYearReportDefs!M:M,MATCH($B75,i_FullYearReportDefs!$B:$B,0)+i_Settings!$C$9-1))","v":"GP3_Attendance"},{"$f":"IF(INDEX(i_FullYearReportDefs!N:N,MATCH($B75,i_FullYearReportDefs!$B:$B,0)+i_Settings!$C$9-1)=\"\",\"\",INDEX(i_FullYearReportDefs!N:N,MATCH($B75,i_FullYearReportDefs!$B:$B,0)+i_Settings!$C$9-1))","v":"GP3_EngCourseFail"},{"$f":"IF(INDEX(i_FullYearReportDefs!O:O,MATCH($B75,i_FullYearReportDefs!$B:$B,0)+i_Settings!$C$9-1)=\"\",\"\",INDEX(i_FullYearReportDefs!O:O,MATCH($B75,i_FullYearReportDefs!$B:$B,0)+i_Settings!$C$9-1))","v":"GP3_MathCourseFail"},{"$f":"IF(INDEX(i_FullYearReportDefs!P:P,MATCH($B75,i_FullYearReportDefs!$B:$B,0)+i_Settings!$C$9-1)=\"\",\"\",INDEX(i_FullYearReportDefs!P:P,MATCH($B75,i_FullYearReportDefs!$B:$B,0)+i_Settings!$C$9-1))","v":"GP3_Behavior"},{"$f":"IF(INDEX(i_FullYearReportDefs!Q:Q,MATCH($B75,i_FullYearReportDefs!$B:$B,0)+i_Settings!$C$9-1)=\"\",\"\",INDEX(i_FullYearReportDefs!Q:Q,MATCH($B75,i_FullYearReportDefs!$B:$B,0)+i_Settings!$C$9-1))","v":"GP4_Attendance"},{"$f":"IF(INDEX(i_FullYearReportDefs!R:R,MATCH($B75,i_FullYearReportDefs!$B:$B,0)+i_Settings!$C$9-1)=\"\",\"\",INDEX(i_FullYearReportDefs!R:R,MATCH($B75,i_FullYearReportDefs!$B:$B,0)+i_Settings!$C$9-1))","v":"GP4_EngCourseFail"},{"$f":"IF(INDEX(i_FullYearReportDefs!S:S,MATCH($B75,i_FullYearReportDefs!$B:$B,0)+i_Settings!$C$9-1)=\"\",\"\",INDEX(i_FullYearReportDefs!S:S,MATCH($B75,i_FullYearReportDefs!$B:$B,0)+i_Settings!$C$9-1))","v":"GP4_MathCourseFail"},{"$f":"IF(INDEX(i_FullYearReportDefs!T:T,MATCH($B75,i_FullYearReportDefs!$B:$B,0)+i_Settings!$C$9-1)=\"\",\"\",INDEX(i_FullYearReportDefs!T:T,MATCH($B75,i_FullYearReportDefs!$B:$B,0)+i_Settings!$C$9-1))","v":"GP4_Behavior"},{"$f":"IF(INDEX(i_FullYearReportDefs!U:U,MATCH($B75,i_FullYearReportDefs!$B:$B,0)+i_Settings!$C$9-1)=\"\",\"\",INDEX(i_FullYearReportDefs!U:U,MATCH($B75,i_FullYearReportDefs!$B:$B,0)+i_Settings!$C$9-1))","v":"eoy_Attendance"},{"$f":"IF(INDEX(i_FullYearReportDefs!V:V,MATCH($B75,i_FullYearReportDefs!$B:$B,0)+i_Settings!$C$9-1)=\"\",\"\",INDEX(i_FullYearReportDefs!V:V,MATCH($B75,i_FullYearReportDefs!$B:$B,0)+i_Settings!$C$9-1))","v":"eoy_EngCourseFail"},{"$f":"IF(INDEX(i_FullYearReportDefs!W:W,MATCH($B75,i_FullYearReportDefs!$B:$B,0)+i_Settings!$C$9-1)=\"\",\"\",INDEX(i_FullYearReportDefs!W:W,MATCH($B75,i_FullYearReportDefs!$B:$B,0)+i_Settings!$C$9-1))","v":"eoy_MathCourseFail"},{"$f":"IF(INDEX(i_FullYearReportDefs!X:X,MATCH($B75,i_FullYearReportDefs!$B:$B,0)+i_Settings!$C$9-1)=\"\",\"\",INDEX(i_FullYearReportDefs!X:X,MATCH($B75,i_FullYearReportDefs!$B:$B,0)+i_Settings!$C$9-1))","v":"eoy_Behavior"},{"$f":"IF(INDEX(i_FullYearReportDefs!Y:Y,MATCH($B75,i_FullYearReportDefs!$B:$B,0)+i_Settings!$C$9-1)=\"\",\"\",INDEX(i_FullYearReportDefs!Y:Y,MATCH($B75,i_FullYearReportDefs!$B:$B,0)+i_Settings!$C$9-1))","v":""},{"$f":"IF(INDEX(i_FullYearReportDefs!Z:Z,MATCH($B75,i_FullYearReportDefs!$B:$B,0)+i_Settings!$C$9-1)=\"\",\"\",INDEX(i_FullYearReportDefs!Z:Z,MATCH($B75,i_FullYearReportDefs!$B:$B,0)+i_Settings!$C$9-1))","v":""}]
[null,"FullFlagged student report: Academics","Student ID","First Name","Last Name",{"$f":"IF(INDEX(i_FullYearReportDefs!C:C,MATCH($B76,i_FullYearReportDefs!$B:$B,0)+i_Settings!$C$9-1)=\"\",\"\",INDEX(i_FullYearReportDefs!C:C,MATCH($B76,i_FullYearReportDefs!$B:$B,0)+i_Settings!$C$9-1))","v":"Pre-HS indicator"},{"$f":"IF(INDEX(i_FullYearReportDefs!D:D,MATCH($B76,i_FullYearReportDefs!$B:$B,0)+i_Settings!$C$9-1)=\"\",\"\",INDEX(i_FullYearReportDefs!D:D,MATCH($B76,i_FullYearReportDefs!$B:$B,0)+i_Settings!$C$9-1))","v":"GP1_First 20 Day Attendance"},{"$f":"IF(INDEX(i_FullYearReportDefs!E:E,MATCH($B76,i_FullYearReportDefs!$B:$B,0)+i_Settings!$C$9-1)=\"\",\"\",INDEX(i_FullYearReportDefs!E:E,MATCH($B76,i_FullYearReportDefs!$B:$B,0)+i_Settings!$C$9-1))","v":"GP1_Attendance"},{"$f":"IF(INDEX(i_FullYearReportDefs!F:F,MATCH($B76,i_FullYearReportDefs!$B:$B,0)+i_Settings!$C$9-1)=\"\",\"\",INDEX(i_FullYearReportDefs!F:F,MATCH($B76,i_FullYearReportDefs!$B:$B,0)+i_Settings!$C$9-1))","v":"GP1_EngCourseFail"},{"$f":"IF(INDEX(i_FullYearReportDefs!G:G,MATCH($B76,i_FullYearReportDefs!$B:$B,0)+i_Settings!$C$9-1)=\"\",\"\",INDEX(i_FullYearReportDefs!G:G,MATCH($B76,i_FullYearReportDefs!$B:$B,0)+i_Settings!$C$9-1))","v":"GP1_MathCourseFail"},{"$f":"IF(INDEX(i_FullYearReportDefs!H:H,MATCH($B76,i_FullYearReportDefs!$B:$B,0)+i_Settings!$C$9-1)=\"\",\"\",INDEX(i_FullYearReportDefs!H:H,MATCH($B76,i_FullYearReportDefs!$B:$B,0)+i_Settings!$C$9-1))","v":"GP1_Behavior"},{"$f":"IF(INDEX(i_FullYearReportDefs!I:I,MATCH($B76,i_FullYearReportDefs!$B:$B,0)+i_Settings!$C$9-1)=\"\",\"\",INDEX(i_FullYearReportDefs!I:I,MATCH($B76,i_FullYearReportDefs!$B:$B,0)+i_Settings!$C$9-1))","v":"GP2_Attendance"},{"$f":"IF(INDEX(i_FullYearReportDefs!J:J,MATCH($B76,i_FullYearReportDefs!$B:$B,0)+i_Settings!$C$9-1)=\"\",\"\",INDEX(i_FullYearReportDefs!J:J,MATCH($B76,i_FullYearReportDefs!$B:$B,0)+i_Settings!$C$9-1))","v":"GP2_EngCourseFail"},{"$f":"IF(INDEX(i_FullYearReportDefs!K:K,MATCH($B76,i_FullYearReportDefs!$B:$B,0)+i_Settings!$C$9-1)=\"\",\"\",INDEX(i_FullYearReportDefs!K:K,MATCH($B76,i_FullYearReportDefs!$B:$B,0)+i_Settings!$C$9-1))","v":"GP2_MathCourseFail"},{"$f":"IF(INDEX(i_FullYearReportDefs!L:L,MATCH($B76,i_FullYearReportDefs!$B:$B,0)+i_Settings!$C$9-1)=\"\",\"\",INDEX(i_FullYearReportDefs!L:L,MATCH($B76,i_FullYearReportDefs!$B:$B,0)+i_Settings!$C$9-1))","v":"GP2_Behavior"},{"$f":"IF(INDEX(i_FullYearReportDefs!M:M,MATCH($B76,i_FullYearReportDefs!$B:$B,0)+i_Settings!$C$9-1)=\"\",\"\",INDEX(i_FullYearReportDefs!M:M,MATCH($B76,i_FullYearReportDefs!$B:$B,0)+i_Settings!$C$9-1))","v":"GP3_Attendance"},{"$f":"IF(INDEX(i_FullYearReportDefs!N:N,MATCH($B76,i_FullYearReportDefs!$B:$B,0)+i_Settings!$C$9-1)=\"\",\"\",INDEX(i_FullYearReportDefs!N:N,MATCH($B76,i_FullYearReportDefs!$B:$B,0)+i_Settings!$C$9-1))","v":"GP3_EngCourseFail"},{"$f":"IF(INDEX(i_FullYearReportDefs!O:O,MATCH($B76,i_FullYearReportDefs!$B:$B,0)+i_Settings!$C$9-1)=\"\",\"\",INDEX(i_FullYearReportDefs!O:O,MATCH($B76,i_FullYearReportDefs!$B:$B,0)+i_Settings!$C$9-1))","v":"GP3_MathCourseFail"},{"$f":"IF(INDEX(i_FullYearReportDefs!P:P,MATCH($B76,i_FullYearReportDefs!$B:$B,0)+i_Settings!$C$9-1)=\"\",\"\",INDEX(i_FullYearReportDefs!P:P,MATCH($B76,i_FullYearReportDefs!$B:$B,0)+i_Settings!$C$9-1))","v":"GP3_Behavior"},{"$f":"IF(INDEX(i_FullYearReportDefs!Q:Q,MATCH($B76,i_FullYearReportDefs!$B:$B,0)+i_Settings!$C$9-1)=\"\",\"\",INDEX(i_FullYearReportDefs!Q:Q,MATCH($B76,i_FullYearReportDefs!$B:$B,0)+i_Settings!$C$9-1))","v":"GP4_Attendance"},{"$f":"IF(INDEX(i_FullYearReportDefs!R:R,MATCH($B76,i_FullYearReportDefs!$B:$B,0)+i_Settings!$C$9-1)=\"\",\"\",INDEX(i_FullYearReportDefs!R:R,MATCH($B76,i_FullYearReportDefs!$B:$B,0)+i_Settings!$C$9-1))","v":"GP4_EngCourseFail"},{"$f":"IF(INDEX(i_FullYearReportDefs!S:S,MATCH($B76,i_FullYearReportDefs!$B:$B,0)+i_Settings!$C$9-1)=\"\",\"\",INDEX(i_FullYearReportDefs!S:S,MATCH($B76,i_FullYearReportDefs!$B:$B,0)+i_Settings!$C$9-1))","v":"GP4_MathCourseFail"},{"$f":"IF(INDEX(i_FullYearReportDefs!T:T,MATCH($B76,i_FullYearReportDefs!$B:$B,0)+i_Settings!$C$9-1)=\"\",\"\",INDEX(i_FullYearReportDefs!T:T,MATCH($B76,i_FullYearReportDefs!$B:$B,0)+i_Settings!$C$9-1))","v":"GP4_Behavior"},{"$f":"IF(INDEX(i_FullYearReportDefs!U:U,MATCH($B76,i_FullYearReportDefs!$B:$B,0)+i_Settings!$C$9-1)=\"\",\"\",INDEX(i_FullYearReportDefs!U:U,MATCH($B76,i_FullYearReportDefs!$B:$B,0)+i_Settings!$C$9-1))","v":"eoy_Attendance"},{"$f":"IF(INDEX(i_FullYearReportDefs!V:V,MATCH($B76,i_FullYearReportDefs!$B:$B,0)+i_Settings!$C$9-1)=\"\",\"\",INDEX(i_FullYearReportDefs!V:V,MATCH($B76,i_FullYearReportDefs!$B:$B,0)+i_Settings!$C$9-1))","v":"eoy_EngCourseFail"},{"$f":"IF(INDEX(i_FullYearReportDefs!W:W,MATCH($B76,i_FullYearReportDefs!$B:$B,0)+i_Settings!$C$9-1)=\"\",\"\",INDEX(i_FullYearReportDefs!W:W,MATCH($B76,i_FullYearReportDefs!$B:$B,0)+i_Settings!$C$9-1))","v":"eoy_MathCourseFail"},{"$f":"IF(INDEX(i_FullYearReportDefs!X:X,MATCH($B76,i_FullYearReportDefs!$B:$B,0)+i_Settings!$C$9-1)=\"\",\"\",INDEX(i_FullYearReportDefs!X:X,MATCH($B76,i_FullYearReportDefs!$B:$B,0)+i_Settings!$C$9-1))","v":"eoy_Behavior"},{"$f":"IF(INDEX(i_FullYearReportDefs!Y:Y,MATCH($B76,i_FullYearReportDefs!$B:$B,0)+i_Settings!$C$9-1)=\"\",\"\",INDEX(i_FullYearReportDefs!Y:Y,MATCH($B76,i_FullYearReportDefs!$B:$B,0)+i_Settings!$C$9-1))","v":""},{"$f":"IF(INDEX(i_FullYearReportDefs!Z:Z,MATCH($B76,i_FullYearReportDefs!$B:$B,0)+i_Settings!$C$9-1)=\"\",\"\",INDEX(i_FullYearReportDefs!Z:Z,MATCH($B76,i_FullYearReportDefs!$B:$B,0)+i_Settings!$C$9-1))","v":""}]
[null,"FullFlagged student report: Attendance","Student ID","First Name","Last Name",{"$f":"IF(INDEX(i_FullYearReportDefs!C:C,MATCH($B77,i_FullYearReportDefs!$B:$B,0)+i_Settings!$C$9-1)=\"\",\"\",INDEX(i_FullYearReportDefs!C:C,MATCH($B77,i_FullYearReportDefs!$B:$B,0)+i_Settings!$C$9-1))","v":"Pre-HS indicator"},{"$f":"IF(INDEX(i_FullYearReportDefs!D:D,MATCH($B77,i_FullYearReportDefs!$B:$B,0)+i_Settings!$C$9-1)=\"\",\"\",INDEX(i_FullYearReportDefs!D:D,MATCH($B77,i_FullYearReportDefs!$B:$B,0)+i_Settings!$C$9-1))","v":"GP1_First 20 Day Attendance"},{"$f":"IF(INDEX(i_FullYearReportDefs!E:E,MATCH($B77,i_FullYearReportDefs!$B:$B,0)+i_Settings!$C$9-1)=\"\",\"\",INDEX(i_FullYearReportDefs!E:E,MATCH($B77,i_FullYearReportDefs!$B:$B,0)+i_Settings!$C$9-1))","v":"GP1_Attendance"},{"$f":"IF(INDEX(i_FullYearReportDefs!F:F,MATCH($B77,i_FullYearReportDefs!$B:$B,0)+i_Settings!$C$9-1)=\"\",\"\",INDEX(i_FullYearReportDefs!F:F,MATCH($B77,i_FullYearReportDefs!$B:$B,0)+i_Settings!$C$9-1))","v":"GP1_EngCourseFail"},{"$f":"IF(INDEX(i_FullYearReportDefs!G:G,MATCH($B77,i_FullYearReportDefs!$B:$B,0)+i_Settings!$C$9-1)=\"\",\"\",INDEX(i_FullYearReportDefs!G:G,MATCH($B77,i_FullYearReportDefs!$B:$B,0)+i_Settings!$C$9-1))","v":"GP1_MathCourseFail"},{"$f":"IF(INDEX(i_FullYearReportDefs!H:H,MATCH($B77,i_FullYearReportDefs!$B:$B,0)+i_Settings!$C$9-1)=\"\",\"\",INDEX(i_FullYearReportDefs!H:H,MATCH($B77,i_FullYearReportDefs!$B:$B,0)+i_Settings!$C$9-1))","v":"GP1_Behavior"},{"$f":"IF(INDEX(i_FullYearReportDefs!I:I,MATCH($B77,i_FullYearReportDefs!$B:$B,0)+i_Settings!$C$9-1)=\"\",\"\",INDEX(i_FullYearReportDefs!I:I,MATCH($B77,i_FullYearReportDefs!$B:$B,0)+i_Settings!$C$9-1))","v":"GP2_Attendance"},{"$f":"IF(INDEX(i_FullYearReportDefs!J:J,MATCH($B77,i_FullYearReportDefs!$B:$B,0)+i_Settings!$C$9-1)=\"\",\"\",INDEX(i_FullYearReportDefs!J:J,MATCH($B77,i_FullYearReportDefs!$B:$B,0)+i_Settings!$C$9-1))","v":"GP2_EngCourseFail"},{"$f":"IF(INDEX(i_FullYearReportDefs!K:K,MATCH($B77,i_FullYearReportDefs!$B:$B,0)+i_Settings!$C$9-1)=\"\",\"\",INDEX(i_FullYearReportDefs!K:K,MATCH($B77,i_FullYearReportDefs!$B:$B,0)+i_Settings!$C$9-1))","v":"GP2_MathCourseFail"},{"$f":"IF(INDEX(i_FullYearReportDefs!L:L,MATCH($B77,i_FullYearReportDefs!$B:$B,0)+i_Settings!$C$9-1)=\"\",\"\",INDEX(i_FullYearReportDefs!L:L,MATCH($B77,i_FullYearReportDefs!$B:$B,0)+i_Settings!$C$9-1))","v":"GP2_Behavior"},{"$f":"IF(INDEX(i_FullYearReportDefs!M:M,MATCH($B77,i_FullYearReportDefs!$B:$B,0)+i_Settings!$C$9-1)=\"\",\"\",INDEX(i_FullYearReportDefs!M:M,MATCH($B77,i_FullYearReportDefs!$B:$B,0)+i_Settings!$C$9-1))","v":"GP3_Attendance"},{"$f":"IF(INDEX(i_FullYearReportDefs!N:N,MATCH($B77,i_FullYearReportDefs!$B:$B,0)+i_Settings!$C$9-1)=\"\",\"\",INDEX(i_FullYearReportDefs!N:N,MATCH($B77,i_FullYearReportDefs!$B:$B,0)+i_Settings!$C$9-1))","v":"GP3_EngCourseFail"},{"$f":"IF(INDEX(i_FullYearReportDefs!O:O,MATCH($B77,i_FullYearReportDefs!$B:$B,0)+i_Settings!$C$9-1)=\"\",\"\",INDEX(i_FullYearReportDefs!O:O,MATCH($B77,i_FullYearReportDefs!$B:$B,0)+i_Settings!$C$9-1))","v":"GP3_MathCourseFail"},{"$f":"IF(INDEX(i_FullYearReportDefs!P:P,MATCH($B77,i_FullYearReportDefs!$B:$B,0)+i_Settings!$C$9-1)=\"\",\"\",INDEX(i_FullYearReportDefs!P:P,MATCH($B77,i_FullYearReportDefs!$B:$B,0)+i_Settings!$C$9-1))","v":"GP3_Behavior"},{"$f":"IF(INDEX(i_FullYearReportDefs!Q:Q,MATCH($B77,i_FullYearReportDefs!$B:$B,0)+i_Settings!$C$9-1)=\"\",\"\",INDEX(i_FullYearReportDefs!Q:Q,MATCH($B77,i_FullYearReportDefs!$B:$B,0)+i_Settings!$C$9-1))","v":"GP4_Attendance"},{"$f":"IF(INDEX(i_FullYearReportDefs!R:R,MATCH($B77,i_FullYearReportDefs!$B:$B,0)+i_Settings!$C$9-1)=\"\",\"\",INDEX(i_FullYearReportDefs!R:R,MATCH($B77,i_FullYearReportDefs!$B:$B,0)+i_Settings!$C$9-1))","v":"GP4_EngCourseFail"},{"$f":"IF(INDEX(i_FullYearReportDefs!S:S,MATCH($B77,i_FullYearReportDefs!$B:$B,0)+i_Settings!$C$9-1)=\"\",\"\",INDEX(i_FullYearReportDefs!S:S,MATCH($B77,i_FullYearReportDefs!$B:$B,0)+i_Settings!$C$9-1))","v":"GP4_MathCourseFail"},{"$f":"IF(INDEX(i_FullYearReportDefs!T:T,MATCH($B77,i_FullYearReportDefs!$B:$B,0)+i_Settings!$C$9-1)=\"\",\"\",INDEX(i_FullYearReportDefs!T:T,MATCH($B77,i_FullYearReportDefs!$B:$B,0)+i_Settings!$C$9-1))","v":"GP4_Behavior"},{"$f":"IF(INDEX(i_FullYearReportDefs!U:U,MATCH($B77,i_FullYearReportDefs!$B:$B,0)+i_Settings!$C$9-1)=\"\",\"\",INDEX(i_FullYearReportDefs!U:U,MATCH($B77,i_FullYearReportDefs!$B:$B,0)+i_Settings!$C$9-1))","v":"eoy_Attendance"},{"$f":"IF(INDEX(i_FullYearReportDefs!V:V,MATCH($B77,i_FullYearReportDefs!$B:$B,0)+i_Settings!$C$9-1)=\"\",\"\",INDEX(i_FullYearReportDefs!V:V,MATCH($B77,i_FullYearReportDefs!$B:$B,0)+i_Settings!$C$9-1))","v":"eoy_EngCourseFail"},{"$f":"IF(INDEX(i_FullYearReportDefs!W:W,MATCH($B77,i_FullYearReportDefs!$B:$B,0)+i_Settings!$C$9-1)=\"\",\"\",INDEX(i_FullYearReportDefs!W:W,MATCH($B77,i_FullYearReportDefs!$B:$B,0)+i_Settings!$C$9-1))","v":"eoy_MathCourseFail"},{"$f":"IF(INDEX(i_FullYearReportDefs!X:X,MATCH($B77,i_FullYearReportDefs!$B:$B,0)+i_Settings!$C$9-1)=\"\",\"\",INDEX(i_FullYearReportDefs!X:X,MATCH($B77,i_FullYearReportDefs!$B:$B,0)+i_Settings!$C$9-1))","v":"eoy_Behavior"},{"$f":"IF(INDEX(i_FullYearReportDefs!Y:Y,MATCH($B77,i_FullYearReportDefs!$B:$B,0)+i_Settings!$C$9-1)=\"\",\"\",INDEX(i_FullYearReportDefs!Y:Y,MATCH($B77,i_FullYearReportDefs!$B:$B,0)+i_Settings!$C$9-1))","v":""},{"$f":"IF(INDEX(i_FullYearReportDefs!Z:Z,MATCH($B77,i_FullYearReportDefs!$B:$B,0)+i_Settings!$C$9-1)=\"\",\"\",INDEX(i_FullYearReportDefs!Z:Z,MATCH($B77,i_FullYearReportDefs!$B:$B,0)+i_Settings!$C$9-1))","v":""}]
[null,"FullFlagged Student Report: Disabilities","Student ID","First Name","Last Name",{"$f":"IF(INDEX(i_FullYearReportDefs!C:C,MATCH($B78,i_FullYearReportDefs!$B:$B,0)+i_Settings!$C$9-1)=\"\",\"\",INDEX(i_FullYearReportDefs!C:C,MATCH($B78,i_FullYearReportDefs!$B:$B,0)+i_Settings!$C$9-1))","v":"Disability"},{"$f":"IF(INDEX(i_FullYearReportDefs!D:D,MATCH($B78,i_FullYearReportDefs!$B:$B,0)+i_Settings!$C$9-1)=\"\",\"\",INDEX(i_FullYearReportDefs!D:D,MATCH($B78,i_FullYearReportDefs!$B:$B,0)+i_Settings!$C$9-1))","v":"GP1_First 20 Day Attendance"},{"$f":"IF(INDEX(i_FullYearReportDefs!E:E,MATCH($B78,i_FullYearReportDefs!$B:$B,0)+i_Settings!$C$9-1)=\"\",\"\",INDEX(i_FullYearReportDefs!E:E,MATCH($B78,i_FullYearReportDefs!$B:$B,0)+i_Settings!$C$9-1))","v":"GP1_Attendance"},{"$f":"IF(INDEX(i_FullYearReportDefs!F:F,MATCH($B78,i_FullYearReportDefs!$B:$B,0)+i_Settings!$C$9-1)=\"\",\"\",INDEX(i_FullYearReportDefs!F:F,MATCH($B78,i_FullYearReportDefs!$B:$B,0)+i_Settings!$C$9-1))","v":"GP1_EngCourseFail"},{"$f":"IF(INDEX(i_FullYearReportDefs!G:G,MATCH($B78,i_FullYearReportDefs!$B:$B,0)+i_Settings!$C$9-1)=\"\",\"\",INDEX(i_FullYearReportDefs!G:G,MATCH($B78,i_FullYearReportDefs!$B:$B,0)+i_Settings!$C$9-1))","v":"GP1_MathCourseFail"},{"$f":"IF(INDEX(i_FullYearReportDefs!H:H,MATCH($B78,i_FullYearReportDefs!$B:$B,0)+i_Settings!$C$9-1)=\"\",\"\",INDEX(i_FullYearReportDefs!H:H,MATCH($B78,i_FullYearReportDefs!$B:$B,0)+i_Settings!$C$9-1))","v":"GP1_Behavior"},{"$f":"IF(INDEX(i_FullYearReportDefs!I:I,MATCH($B78,i_FullYearReportDefs!$B:$B,0)+i_Settings!$C$9-1)=\"\",\"\",INDEX(i_FullYearReportDefs!I:I,MATCH($B78,i_FullYearReportDefs!$B:$B,0)+i_Settings!$C$9-1))","v":"GP1 Interventions"},{"$f":"IF(INDEX(i_FullYearReportDefs!J:J,MATCH($B78,i_FullYearReportDefs!$B:$B,0)+i_Settings!$C$9-1)=\"\",\"\",INDEX(i_FullYearReportDefs!J:J,MATCH($B78,i_FullYearReportDefs!$B:$B,0)+i_Settings!$C$9-1))","v":"GP2_Attendance"},{"$f":"IF(INDEX(i_FullYearReportDefs!K:K,MATCH($B78,i_FullYearReportDefs!$B:$B,0)+i_Settings!$C$9-1)=\"\",\"\",INDEX(i_FullYearReportDefs!K:K,MATCH($B78,i_FullYearReportDefs!$B:$B,0)+i_Settings!$C$9-1))","v":"GP2_EngCourseFail"},{"$f":"IF(INDEX(i_FullYearReportDefs!L:L,MATCH($B78,i_FullYearReportDefs!$B:$B,0)+i_Settings!$C$9-1)=\"\",\"\",INDEX(i_FullYearReportDefs!L:L,MATCH($B78,i_FullYearReportDefs!$B:$B,0)+i_Settings!$C$9-1))","v":"GP2_MathCourseFail"},{"$f":"IF(INDEX(i_FullYearReportDefs!M:M,MATCH($B78,i_FullYearReportDefs!$B:$B,0)+i_Settings!$C$9-1)=\"\",\"\",INDEX(i_FullYearReportDefs!M:M,MATCH($B78,i_FullYearReportDefs!$B:$B,0)+i_Settings!$C$9-1))","v":"GP2_Behavior"},{"$f":"IF(INDEX(i_FullYearReportDefs!N:N,MATCH($B78,i_FullYearReportDefs!$B:$B,0)+i_Settings!$C$9-1)=\"\",\"\",INDEX(i_FullYearReportDefs!N:N,MATCH($B78,i_FullYearReportDefs!$B:$B,0)+i_Settings!$C$9-1))","v":"GP2 Interventions"},{"$f":"IF(INDEX(i_FullYearReportDefs!O:O,MATCH($B78,i_FullYearReportDefs!$B:$B,0)+i_Settings!$C$9-1)=\"\",\"\",INDEX(i_FullYearReportDefs!O:O,MATCH($B78,i_FullYearReportDefs!$B:$B,0)+i_Settings!$C$9-1))","v":"GP3_Attendance"},{"$f":"IF(INDEX(i_FullYearReportDefs!P:P,MATCH($B78,i_FullYearReportDefs!$B:$B,0)+i_Settings!$C$9-1)=\"\",\"\",INDEX(i_FullYearReportDefs!P:P,MATCH($B78,i_FullYearReportDefs!$B:$B,0)+i_Settings!$C$9-1))","v":"GP3_EngCourseFail"},{"$f":"IF(INDEX(i_FullYearReportDefs!Q:Q,MATCH($B78,i_FullYearReportDefs!$B:$B,0)+i_Settings!$C$9-1)=\"\",\"\",INDEX(i_FullYearReportDefs!Q:Q,MATCH($B78,i_FullYearReportDefs!$B:$B,0)+i_Settings!$C$9-1))","v":"GP3_MathCourseFail"},{"$f":"IF(INDEX(i_FullYearReportDefs!R:R,MATCH($B78,i_FullYearReportDefs!$B:$B,0)+i_Settings!$C$9-1)=\"\",\"\",INDEX(i_FullYearReportDefs!R:R,MATCH($B78,i_FullYearReportDefs!$B:$B,0)+i_Settings!$C$9-1))","v":"GP3_Behavior"},{"$f":"IF(INDEX(i_FullYearReportDefs!S:S,MATCH($B78,i_FullYearReportDefs!$B:$B,0)+i_Settings!$C$9-1)=\"\",\"\",INDEX(i_FullYearReportDefs!S:S,MATCH($B78,i_FullYearReportDefs!$B:$B,0)+i_Settings!$C$9-1))","v":"GP3 Interventions"},{"$f":"IF(INDEX(i_FullYearReportDefs!T:T,MATCH($B78,i_FullYearReportDefs!$B:$B,0)+i_Settings!$C$9-1)=\"\",\"\",INDEX(i_FullYearReportDefs!T:T,MATCH($B78,i_FullYearReportDefs!$B:$B,0)+i_Settings!$C$9-1))","v":"GP4_Attendance"},{"$f":"IF(INDEX(i_FullYearReportDefs!U:U,MATCH($B78,i_FullYearReportDefs!$B:$B,0)+i_Settings!$C$9-1)=\"\",\"\",INDEX(i_FullYearReportDefs!U:U,MATCH($B78,i_FullYearReportDefs!$B:$B,0)+i_Settings!$C$9-1))","v":"GP4_EngCourseFail"},{"$f":"IF(INDEX(i_FullYearReportDefs!V:V,MATCH($B78,i_FullYearReportDefs!$B:$B,0)+i_Settings!$C$9-1)=\"\",\"\",INDEX(i_FullYearReportDefs!V:V,MATCH($B78,i_FullYearReportDefs!$B:$B,0)+i_Settings!$C$9-1))","v":"GP4_MathCourseFail"},{"$f":"IF(INDEX(i_FullYearReportDefs!W:W,MATCH($B78,i_FullYearReportDefs!$B:$B,0)+i_Settings!$C$9-1)=\"\",\"\",INDEX(i_FullYearReportDefs!W:W,MATCH($B78,i_FullYearReportDefs!$B:$B,0)+i_Settings!$C$9-1))","v":"GP4_Behavior"},{"$f":"IF(INDEX(i_FullYearReportDefs!X:X,MATCH($B78,i_FullYearReportDefs!$B:$B,0)+i_Settings!$C$9-1)=\"\",\"\",INDEX(i_FullYearReportDefs!X:X,MATCH($B78,i_FullYearReportDefs!$B:$B,0)+i_Settings!$C$9-1))","v":"GP4 Interventions"},{"$f":"IF(INDEX(i_FullYearReportDefs!Y:Y,MATCH($B78,i_FullYearReportDefs!$B:$B,0)+i_Settings!$C$9-1)=\"\",\"\",INDEX(i_FullYearReportDefs!Y:Y,MATCH($B78,i_FullYearReportDefs!$B:$B,0)+i_Settings!$C$9-1))","v":"eoy_Attendance"},{"$f":"IF(INDEX(i_FullYearReportDefs!Z:Z,MATCH($B78,i_FullYearReportDefs!$B:$B,0)+i_Settings!$C$9-1)=\"\",\"\",INDEX(i_FullYearReportDefs!Z:Z,MATCH($B78,i_FullYearReportDefs!$B:$B,0)+i_Settings!$C$9-1))","v":"eoy_EngCourseFail"}]
[null,"FullFlagged Student Report: ELL","Student ID","First Name","Last Name",{"$f":"IF(INDEX(i_FullYearReportDefs!C:C,MATCH($B79,i_FullYearReportDefs!$B:$B,0)+i_Settings!$C$9-1)=\"\",\"\",INDEX(i_FullYearReportDefs!C:C,MATCH($B79,i_FullYearReportDefs!$B:$B,0)+i_Settings!$C$9-1))","v":"ELL status"},{"$f":"IF(INDEX(i_FullYearReportDefs!D:D,MATCH($B79,i_FullYearReportDefs!$B:$B,0)+i_Settings!$C$9-1)=\"\",\"\",INDEX(i_FullYearReportDefs!D:D,MATCH($B79,i_FullYearReportDefs!$B:$B,0)+i_Settings!$C$9-1))","v":"GP1_First 20 Day Attendance"},{"$f":"IF(INDEX(i_FullYearReportDefs!E:E,MATCH($B79,i_FullYearReportDefs!$B:$B,0)+i_Settings!$C$9-1)=\"\",\"\",INDEX(i_FullYearReportDefs!E:E,MATCH($B79,i_FullYearReportDefs!$B:$B,0)+i_Settings!$C$9-1))","v":"GP1_Attendance"},{"$f":"IF(INDEX(i_FullYearReportDefs!F:F,MATCH($B79,i_FullYearReportDefs!$B:$B,0)+i_Settings!$C$9-1)=\"\",\"\",INDEX(i_FullYearReportDefs!F:F,MATCH($B79,i_FullYearReportDefs!$B:$B,0)+i_Settings!$C$9-1))","v":"GP1_EngCourseFail"},{"$f":"IF(INDEX(i_FullYearReportDefs!G:G,MATCH($B79,i_FullYearReportDefs!$B:$B,0)+i_Settings!$C$9-1)=\"\",\"\",INDEX(i_FullYearReportDefs!G:G,MATCH($B79,i_FullYearReportDefs!$B:$B,0)+i_Settings!$C$9-1))","v":"GP1_MathCourseFail"},{"$f":"IF(INDEX(i_FullYearReportDefs!H:H,MATCH($B79,i_FullYearReportDefs!$B:$B,0)+i_Settings!$C$9-1)=\"\",\"\",INDEX(i_FullYearReportDefs!H:H,MATCH($B79,i_FullYearReportDefs!$B:$B,0)+i_Settings!$C$9-1))","v":"GP1_Behavior"},{"$f":"IF(INDEX(i_FullYearReportDefs!I:I,MATCH($B79,i_FullYearReportDefs!$B:$B,0)+i_Settings!$C$9-1)=\"\",\"\",INDEX(i_FullYearReportDefs!I:I,MATCH($B79,i_FullYearReportDefs!$B:$B,0)+i_Settings!$C$9-1))","v":"GP1 Interventions"},{"$f":"IF(INDEX(i_FullYearReportDefs!J:J,MATCH($B79,i_FullYearReportDefs!$B:$B,0)+i_Settings!$C$9-1)=\"\",\"\",INDEX(i_FullYearReportDefs!J:J,MATCH($B79,i_FullYearReportDefs!$B:$B,0)+i_Settings!$C$9-1))","v":"GP2_Attendance"},{"$f":"IF(INDEX(i_FullYearReportDefs!K:K,MATCH($B79,i_FullYearReportDefs!$B:$B,0)+i_Settings!$C$9-1)=\"\",\"\",INDEX(i_FullYearReportDefs!K:K,MATCH($B79,i_FullYearReportDefs!$B:$B,0)+i_Settings!$C$9-1))","v":"GP2_EngCourseFail"},{"$f":"IF(INDEX(i_FullYearReportDefs!L:L,MATCH($B79,i_FullYearReportDefs!$B:$B,0)+i_Settings!$C$9-1)=\"\",\"\",INDEX(i_FullYearReportDefs!L:L,MATCH($B79,i_FullYearReportDefs!$B:$B,0)+i_Settings!$C$9-1))","v":"GP2_MathCourseFail"},{"$f":"IF(INDEX(i_FullYearReportDefs!M:M,MATCH($B79,i_FullYearReportDefs!$B:$B,0)+i_Settings!$C$9-1)=\"\",\"\",INDEX(i_FullYearReportDefs!M:M,MATCH($B79,i_FullYearReportDefs!$B:$B,0)+i_Settings!$C$9-1))","v":"GP2_Behavior"},{"$f":"IF(INDEX(i_FullYearReportDefs!N:N,MATCH($B79,i_FullYearReportDefs!$B:$B,0)+i_Settings!$C$9-1)=\"\",\"\",INDEX(i_FullYearReportDefs!N:N,MATCH($B79,i_FullYearReportDefs!$B:$B,0)+i_Settings!$C$9-1))","v":"GP2 Interventions"},{"$f":"IF(INDEX(i_FullYearReportDefs!O:O,MATCH($B79,i_FullYearReportDefs!$B:$B,0)+i_Settings!$C$9-1)=\"\",\"\",INDEX(i_FullYearReportDefs!O:O,MATCH($B79,i_FullYearReportDefs!$B:$B,0)+i_Settings!$C$9-1))","v":"GP3_Attendance"},{"$f":"IF(INDEX(i_FullYearReportDefs!P:P,MATCH($B79,i_FullYearReportDefs!$B:$B,0)+i_Settings!$C$9-1)=\"\",\"\",INDEX(i_FullYearReportDefs!P:P,MATCH($B79,i_FullYearReportDefs!$B:$B,0)+i_Settings!$C$9-1))","v":"GP3_EngCourseFail"},{"$f":"IF(INDEX(i_FullYearReportDefs!Q:Q,MATCH($B79,i_FullYearReportDefs!$B:$B,0)+i_Settings!$C$9-1)=\"\",\"\",INDEX(i_FullYearReportDefs!Q:Q,MATCH($B79,i_FullYearReportDefs!$B:$B,0)+i_Settings!$C$9-1))","v":"GP3_MathCourseFail"},{"$f":"IF(INDEX(i_FullYearReportDefs!R:R,MATCH($B79,i_FullYearReportDefs!$B:$B,0)+i_Settings!$C$9-1)=\"\",\"\",INDEX(i_FullYearReportDefs!R:R,MATCH($B79,i_FullYearReportDefs!$B:$B,0)+i_Settings!$C$9-1))","v":"GP3_Behavior"},{"$f":"IF(INDEX(i_FullYearReportDefs!S:S,MATCH($B79,i_FullYearReportDefs!$B:$B,0)+i_Settings!$C$9-1)=\"\",\"\",INDEX(i_FullYearReportDefs!S:S,MATCH($B79,i_FullYearReportDefs!$B:$B,0)+i_Settings!$C$9-1))","v":"GP3 Interventions"},{"$f":"IF(INDEX(i_FullYearReportDefs!T:T,MATCH($B79,i_FullYearReportDefs!$B:$B,0)+i_Settings!$C$9-1)=\"\",\"\",INDEX(i_FullYearReportDefs!T:T,MATCH($B79,i_FullYearReportDefs!$B:$B,0)+i_Settings!$C$9-1))","v":"GP4_Attendance"},{"$f":"IF(INDEX(i_FullYearReportDefs!U:U,MATCH($B79,i_FullYearReportDefs!$B:$B,0)+i_Settings!$C$9-1)=\"\",\"\",INDEX(i_FullYearReportDefs!U:U,MATCH($B79,i_FullYearReportDefs!$B:$B,0)+i_Settings!$C$9-1))","v":"GP4_EngCourseFail"},{"$f":"IF(INDEX(i_FullYearReportDefs!V:V,MATCH($B79,i_FullYearReportDefs!$B:$B,0)+i_Settings!$C$9-1)=\"\",\"\",INDEX(i_FullYearReportDefs!V:V,MATCH($B79,i_FullYearReportDefs!$B:$B,0)+i_Settings!$C$9-1))","v":"GP4_MathCourseFail"},{"$f":"IF(INDEX(i_FullYearReportDefs!W:W,MATCH($B79,i_FullYearReportDefs!$B:$B,0)+i_Settings!$C$9-1)=\"\",\"\",INDEX(i_FullYearReportDefs!W:W,MATCH($B79,i_FullYearReportDefs!$B:$B,0)+i_Settings!$C$9-1))","v":"GP4_Behavior"},{"$f":"IF(INDEX(i_FullYearReportDefs!X:X,MATCH($B79,i_FullYearReportDefs!$B:$B,0)+i_Settings!$C$9-1)=\"\",\"\",INDEX(i_FullYearReportDefs!X:X,MATCH($B79,i_FullYearReportDefs!$B:$B,0)+i_Settings!$C$9-1))","v":"GP4 Interventions"},{"$f":"IF(INDEX(i_FullYearReportDefs!Y:Y,MATCH($B79,i_FullYearReportDefs!$B:$B,0)+i_Settings!$C$9-1)=\"\",\"\",INDEX(i_FullYearReportDefs!Y:Y,MATCH($B79,i_FullYearReportDefs!$B:$B,0)+i_Settings!$C$9-1))","v":"eoy_Attendance"},{"$f":"IF(INDEX(i_FullYearReportDefs!Z:Z,MATCH($B79,i_FullYearReportDefs!$B:$B,0)+i_Settings!$C$9-1)=\"\",\"\",INDEX(i_FullYearReportDefs!Z:Z,MATCH($B79,i_FullYearReportDefs!$B:$B,0)+i_Settings!$C$9-1))","v":"eoy_EngCourseFail"}]
[null,"FullFlagged Student Report: Disadvantaged","Student ID","First Name","Last Name",{"$f":"IF(INDEX(i_FullYearReportDefs!C:C,MATCH($B80,i_FullYearReportDefs!$B:$B,0)+i_Settings!$C$9-1)=\"\",\"\",INDEX(i_FullYearReportDefs!C:C,MATCH($B80,i_FullYearReportDefs!$B:$B,0)+i_Settings!$C$9-1))","v":"Disadvantaged"},{"$f":"IF(INDEX(i_FullYearReportDefs!D:D,MATCH($B80,i_FullYearReportDefs!$B:$B,0)+i_Settings!$C$9-1)=\"\",\"\",INDEX(i_FullYearReportDefs!D:D,MATCH($B80,i_FullYearReportDefs!$B:$B,0)+i_Settings!$C$9-1))","v":"GP1_First 20 Day Attendance"},{"$f":"IF(INDEX(i_FullYearReportDefs!E:E,MATCH($B80,i_FullYearReportDefs!$B:$B,0)+i_Settings!$C$9-1)=\"\",\"\",INDEX(i_FullYearReportDefs!E:E,MATCH($B80,i_FullYearReportDefs!$B:$B,0)+i_Settings!$C$9-1))","v":"GP1_Attendance"},{"$f":"IF(INDEX(i_FullYearReportDefs!F:F,MATCH($B80,i_FullYearReportDefs!$B:$B,0)+i_Settings!$C$9-1)=\"\",\"\",INDEX(i_FullYearReportDefs!F:F,MATCH($B80,i_FullYearReportDefs!$B:$B,0)+i_Settings!$C$9-1))","v":"GP1_EngCourseFail"},{"$f":"IF(INDEX(i_FullYearReportDefs!G:G,MATCH($B80,i_FullYearReportDefs!$B:$B,0)+i_Settings!$C$9-1)=\"\",\"\",INDEX(i_FullYearReportDefs!G:G,MATCH($B80,i_FullYearReportDefs!$B:$B,0)+i_Settings!$C$9-1))","v":"GP1_MathCourseFail"},{"$f":"IF(INDEX(i_FullYearReportDefs!H:H,MATCH($B80,i_FullYearReportDefs!$B:$B,0)+i_Settings!$C$9-1)=\"\",\"\",INDEX(i_FullYearReportDefs!H:H,MATCH($B80,i_FullYearReportDefs!$B:$B,0)+i_Settings!$C$9-1))","v":"GP1_Behavior"},{"$f":"IF(INDEX(i_FullYearReportDefs!I:I,MATCH($B80,i_FullYearReportDefs!$B:$B,0)+i_Settings!$C$9-1)=\"\",\"\",INDEX(i_FullYearReportDefs!I:I,MATCH($B80,i_FullYearReportDefs!$B:$B,0)+i_Settings!$C$9-1))","v":"GP1 Interventions"},{"$f":"IF(INDEX(i_FullYearReportDefs!J:J,MATCH($B80,i_FullYearReportDefs!$B:$B,0)+i_Settings!$C$9-1)=\"\",\"\",INDEX(i_FullYearReportDefs!J:J,MATCH($B80,i_FullYearReportDefs!$B:$B,0)+i_Settings!$C$9-1))","v":"GP2_Attendance"},{"$f":"IF(INDEX(i_FullYearReportDefs!K:K,MATCH($B80,i_FullYearReportDefs!$B:$B,0)+i_Settings!$C$9-1)=\"\",\"\",INDEX(i_FullYearReportDefs!K:K,MATCH($B80,i_FullYearReportDefs!$B:$B,0)+i_Settings!$C$9-1))","v":"GP2_EngCourseFail"},{"$f":"IF(INDEX(i_FullYearReportDefs!L:L,MATCH($B80,i_FullYearReportDefs!$B:$B,0)+i_Settings!$C$9-1)=\"\",\"\",INDEX(i_FullYearReportDefs!L:L,MATCH($B80,i_FullYearReportDefs!$B:$B,0)+i_Settings!$C$9-1))","v":"GP2_MathCourseFail"},{"$f":"IF(INDEX(i_FullYearReportDefs!M:M,MATCH($B80,i_FullYearReportDefs!$B:$B,0)+i_Settings!$C$9-1)=\"\",\"\",INDEX(i_FullYearReportDefs!M:M,MATCH($B80,i_FullYearReportDefs!$B:$B,0)+i_Settings!$C$9-1))","v":"GP2_Behavior"},{"$f":"IF(INDEX(i_FullYearReportDefs!N:N,MATCH($B80,i_FullYearReportDefs!$B:$B,0)+i_Settings!$C$9-1)=\"\",\"\",INDEX(i_FullYearReportDefs!N:N,MATCH($B80,i_FullYearReportDefs!$B:$B,0)+i_Settings!$C$9-1))","v":"GP2 Interventions"},{"$f":"IF(INDEX(i_FullYearReportDefs!O:O,MATCH($B80,i_FullYearReportDefs!$B:$B,0)+i_Settings!$C$9-1)=\"\",\"\",INDEX(i_FullYearReportDefs!O:O,MATCH($B80,i_FullYearReportDefs!$B:$B,0)+i_Settings!$C$9-1))","v":"GP3_Attendance"},{"$f":"IF(INDEX(i_FullYearReportDefs!P:P,MATCH($B80,i_FullYearReportDefs!$B:$B,0)+i_Settings!$C$9-1)=\"\",\"\",INDEX(i_FullYearReportDefs!P:P,MATCH($B80,i_FullYearReportDefs!$B:$B,0)+i_Settings!$C$9-1))","v":"GP3_EngCourseFail"},{"$f":"IF(INDEX(i_FullYearReportDefs!Q:Q,MATCH($B80,i_FullYearReportDefs!$B:$B,0)+i_Settings!$C$9-1)=\"\",\"\",INDEX(i_FullYearReportDefs!Q:Q,MATCH($B80,i_FullYearReportDefs!$B:$B,0)+i_Settings!$C$9-1))","v":"GP3_MathCourseFail"},{"$f":"IF(INDEX(i_FullYearReportDefs!R:R,MATCH($B80,i_FullYearReportDefs!$B:$B,0)+i_Settings!$C$9-1)=\"\",\"\",INDEX(i_FullYearReportDefs!R:R,MATCH($B80,i_FullYearReportDefs!$B:$B,0)+i_Settings!$C$9-1))","v":"GP3_Behavior"},{"$f":"IF(INDEX(i_FullYearReportDefs!S:S,MATCH($B80,i_FullYearReportDefs!$B:$B,0)+i_Settings!$C$9-1)=\"\",\"\",INDEX(i_FullYearReportDefs!S:S,MATCH($B80,i_FullYearReportDefs!$B:$B,0)+i_Settings!$C$9-1))","v":"GP3 Interventions"},{"$f":"IF(INDEX(i_FullYearReportDefs!T:T,MATCH($B80,i_FullYearReportDefs!$B:$B,0)+i_Settings!$C$9-1)=\"\",\"\",INDEX(i_FullYearReportDefs!T:T,MATCH($B80,i_FullYearReportDefs!$B:$B,0)+i_Settings!$C$9-1))","v":"GP4_Attendance"},{"$f":"IF(INDEX(i_FullYearReportDefs!U:U,MATCH($B80,i_FullYearReportDefs!$B:$B,0)+i_Settings!$C$9-1)=\"\",\"\",INDEX(i_FullYearReportDefs!U:U,MATCH($B80,i_FullYearReportDefs!$B:$B,0)+i_Settings!$C$9-1))","v":"GP4_EngCourseFail"},{"$f":"IF(INDEX(i_FullYearReportDefs!V:V,MATCH($B80,i_FullYearReportDefs!$B:$B,0)+i_Settings!$C$9-1)=\"\",\"\",INDEX(i_FullYearReportDefs!V:V,MATCH($B80,i_FullYearReportDefs!$B:$B,0)+i_Settings!$C$9-1))","v":"GP4_MathCourseFail"},{"$f":"IF(INDEX(i_FullYearReportDefs!W:W,MATCH($B80,i_FullYearReportDefs!$B:$B,0)+i_Settings!$C$9-1)=\"\",\"\",INDEX(i_FullYearReportDefs!W:W,MATCH($B80,i_FullYearReportDefs!$B:$B,0)+i_Settings!$C$9-1))","v":"GP4_Behavior"},{"$f":"IF(INDEX(i_FullYearReportDefs!X:X,MATCH($B80,i_FullYearReportDefs!$B:$B,0)+i_Settings!$C$9-1)=\"\",\"\",INDEX(i_FullYearReportDefs!X:X,MATCH($B80,i_FullYearReportDefs!$B:$B,0)+i_Settings!$C$9-1))","v":"GP4 Interventions"},{"$f":"IF(INDEX(i_FullYearReportDefs!Y:Y,MATCH($B80,i_FullYearReportDefs!$B:$B,0)+i_Settings!$C$9-1)=\"\",\"\",INDEX(i_FullYearReportDefs!Y:Y,MATCH($B80,i_FullYearReportDefs!$B:$B,0)+i_Settings!$C$9-1))","v":"eoy_Attendance"},{"$f":"IF(INDEX(i_FullYearReportDefs!Z:Z,MATCH($B80,i_FullYearReportDefs!$B:$B,0)+i_Settings!$C$9-1)=\"\",\"\",INDEX(i_FullYearReportDefs!Z:Z,MATCH($B80,i_FullYearReportDefs!$B:$B,0)+i_Settings!$C$9-1))","v":"eoy_EngCourseFail"}]
[null,"FullIntervention report","Student ID","First Name","Last Name",{"$f":"IF(INDEX(i_FullYearReportDefs!C:C,MATCH($B81,i_FullYearReportDefs!$B:$B,0)+i_Settings!$C$9-1)=\"\",\"\",INDEX(i_FullYearReportDefs!C:C,MATCH($B81,i_FullYearReportDefs!$B:$B,0)+i_Settings!$C$9-1))","v":"GP1_First 20 Day Attendance"},{"$f":"IF(INDEX(i_FullYearReportDefs!D:D,MATCH($B81,i_FullYearReportDefs!$B:$B,0)+i_Settings!$C$9-1)=\"\",\"\",INDEX(i_FullYearReportDefs!D:D,MATCH($B81,i_FullYearReportDefs!$B:$B,0)+i_Settings!$C$9-1))","v":"GP1_Attendance"},{"$f":"IF(INDEX(i_FullYearReportDefs!E:E,MATCH($B81,i_FullYearReportDefs!$B:$B,0)+i_Settings!$C$9-1)=\"\",\"\",INDEX(i_FullYearReportDefs!E:E,MATCH($B81,i_FullYearReportDefs!$B:$B,0)+i_Settings!$C$9-1))","v":"GP1_EngCourseFail"},{"$f":"IF(INDEX(i_FullYearReportDefs!F:F,MATCH($B81,i_FullYearReportDefs!$B:$B,0)+i_Settings!$C$9-1)=\"\",\"\",INDEX(i_FullYearReportDefs!F:F,MATCH($B81,i_FullYearReportDefs!$B:$B,0)+i_Settings!$C$9-1))","v":"GP1_MathCourseFail"},{"$f":"IF(INDEX(i_FullYearReportDefs!G:G,MATCH($B81,i_FullYearReportDefs!$B:$B,0)+i_Settings!$C$9-1)=\"\",\"\",INDEX(i_FullYearReportDefs!G:G,MATCH($B81,i_FullYearReportDefs!$B:$B,0)+i_Settings!$C$9-1))","v":"GP1_Behavior"},{"$f":"IF(INDEX(i_FullYearReportDefs!H:H,MATCH($B81,i_FullYearReportDefs!$B:$B,0)+i_Settings!$C$9-1)=\"\",\"\",INDEX(i_FullYearReportDefs!H:H,MATCH($B81,i_FullYearReportDefs!$B:$B,0)+i_Settings!$C$9-1))","v":"GP1_Int flag"},{"$f":"IF(INDEX(i_FullYearReportDefs!I:I,MATCH($B81,i_FullYearReportDefs!$B:$B,0)+i_Settings!$C$9-1)=\"\",\"\",INDEX(i_FullYearReportDefs!I:I,MATCH($B81,i_FullYearReportDefs!$B:$B,0)+i_Settings!$C$9-1))","v":"GP2_Attendance"},{"$f":"IF(INDEX(i_FullYearReportDefs!J:J,MATCH($B81,i_FullYearReportDefs!$B:$B,0)+i_Settings!$C$9-1)=\"\",\"\",INDEX(i_FullYearReportDefs!J:J,MATCH($B81,i_FullYearReportDefs!$B:$B,0)+i_Settings!$C$9-1))","v":"GP2_EngCourseFail"},{"$f":"IF(INDEX(i_FullYearReportDefs!K:K,MATCH($B81,i_FullYearReportDefs!$B:$B,0)+i_Settings!$C$9-1)=\"\",\"\",INDEX(i_FullYearReportDefs!K:K,MATCH($B81,i_FullYearReportDefs!$B:$B,0)+i_Settings!$C$9-1))","v":"GP2_MathCourseFail"},{"$f":"IF(INDEX(i_FullYearReportDefs!L:L,MATCH($B81,i_FullYearReportDefs!$B:$B,0)+i_Settings!$C$9-1)=\"\",\"\",INDEX(i_FullYearReportDefs!L:L,MATCH($B81,i_FullYearReportDefs!$B:$B,0)+i_Settings!$C$9-1))","v":"GP2_Behavior"},{"$f":"IF(INDEX(i_FullYearReportDefs!M:M,MATCH($B81,i_FullYearReportDefs!$B:$B,0)+i_Settings!$C$9-1)=\"\",\"\",INDEX(i_FullYearReportDefs!M:M,MATCH($B81,i_FullYearReportDefs!$B:$B,0)+i_Settings!$C$9-1))","v":"GP2_Int flag"},{"$f":"IF(INDEX(i_FullYearReportDefs!N:N,MATCH($B81,i_FullYearReportDefs!$B:$B,0)+i_Settings!$C$9-1)=\"\",\"\",INDEX(i_FullYearReportDefs!N:N,MATCH($B81,i_FullYearReportDefs!$B:$B,0)+i_Settings!$C$9-1))","v":"GP3_Attendance"},{"$f":"IF(INDEX(i_FullYearReportDefs!O:O,MATCH($B81,i_FullYearReportDefs!$B:$B,0)+i_Settings!$C$9-1)=\"\",\"\",INDEX(i_FullYearReportDefs!O:O,MATCH($B81,i_FullYearReportDefs!$B:$B,0)+i_Settings!$C$9-1))","v":"GP3_EngCourseFail"},{"$f":"IF(INDEX(i_FullYearReportDefs!P:P,MATCH($B81,i_FullYearReportDefs!$B:$B,0)+i_Settings!$C$9-1)=\"\",\"\",INDEX(i_FullYearReportDefs!P:P,MATCH($B81,i_FullYearReportDefs!$B:$B,0)+i_Settings!$C$9-1))","v":"GP3_MathCourseFail"},{"$f":"IF(INDEX(i_FullYearReportDefs!Q:Q,MATCH($B81,i_FullYearReportDefs!$B:$B,0)+i_Settings!$C$9-1)=\"\",\"\",INDEX(i_FullYearReportDefs!Q:Q,MATCH($B81,i_FullYearReportDefs!$B:$B,0)+i_Settings!$C$9-1))","v":"GP3_Behavior"},{"$f":"IF(INDEX(i_FullYearReportDefs!R:R,MATCH($B81,i_FullYearReportDefs!$B:$B,0)+i_Settings!$C$9-1)=\"\",\"\",INDEX(i_FullYearReportDefs!R:R,MATCH($B81,i_FullYearReportDefs!$B:$B,0)+i_Settings!$C$9-1))","v":"GP3_Int flag"},{"$f":"IF(INDEX(i_FullYearReportDefs!S:S,MATCH($B81,i_FullYearReportDefs!$B:$B,0)+i_Settings!$C$9-1)=\"\",\"\",INDEX(i_FullYearReportDefs!S:S,MATCH($B81,i_FullYearReportDefs!$B:$B,0)+i_Settings!$C$9-1))","v":"GP4_Attendance"},{"$f":"IF(INDEX(i_FullYearReportDefs!T:T,MATCH($B81,i_FullYearReportDefs!$B:$B,0)+i_Settings!$C$9-1)=\"\",\"\",INDEX(i_FullYearReportDefs!T:T,MATCH($B81,i_FullYearReportDefs!$B:$B,0)+i_Settings!$C$9-1))","v":"GP4_EngCourseFail"},{"$f":"IF(INDEX(i_FullYearReportDefs!U:U,MATCH($B81,i_FullYearReportDefs!$B:$B,0)+i_Settings!$C$9-1)=\"\",\"\",INDEX(i_FullYearReportDefs!U:U,MATCH($B81,i_FullYearReportDefs!$B:$B,0)+i_Settings!$C$9-1))","v":"GP4_MathCourseFail"},{"$f":"IF(INDEX(i_FullYearReportDefs!V:V,MATCH($B81,i_FullYearReportDefs!$B:$B,0)+i_Settings!$C$9-1)=\"\",\"\",INDEX(i_FullYearReportDefs!V:V,MATCH($B81,i_FullYearReportDefs!$B:$B,0)+i_Settings!$C$9-1))","v":"GP4_Behavior"},{"$f":"IF(INDEX(i_FullYearReportDefs!W:W,MATCH($B81,i_FullYearReportDefs!$B:$B,0)+i_Settings!$C$9-1)=\"\",\"\",INDEX(i_FullYearReportDefs!W:W,MATCH($B81,i_FullYearReportDefs!$B:$B,0)+i_Settings!$C$9-1))","v":"GP4_Int flag"},{"$f":"IF(INDEX(i_FullYearReportDefs!X:X,MATCH($B81,i_FullYearReportDefs!$B:$B,0)+i_Settings!$C$9-1)=\"\",\"\",INDEX(i_FullYearReportDefs!X:X,MATCH($B81,i_FullYearReportDefs!$B:$B,0)+i_Settings!$C$9-1))","v":"eoy_Attendance"},{"$f":"IF(INDEX(i_FullYearReportDefs!Y:Y,MATCH($B81,i_FullYearReportDefs!$B:$B,0)+i_Settings!$C$9-1)=\"\",\"\",INDEX(i_FullYearReportDefs!Y:Y,MATCH($B81,i_FullYearReportDefs!$B:$B,0)+i_Settings!$C$9-1))","v":"eoy_EngCourseFail"},{"$f":"IF(INDEX(i_FullYearReportDefs!Z:Z,MATCH($B81,i_FullYearReportDefs!$B:$B,0)+i_Settings!$C$9-1)=\"\",\"\",INDEX(i_FullYearReportDefs!Z:Z,MATCH($B81,i_FullYearReportDefs!$B:$B,0)+i_Settings!$C$9-1))","v":"eoy_MathCourseFail"}]
[null,"FullStudent Dropout Report","Student ID","First Name","Last Name",{"$f":"IF(INDEX(i_FullYearReportDefs!C:C,MATCH($B82,i_FullYearReportDefs!$B:$B,0)+i_Settings!$C$9-1)=\"\",\"\",INDEX(i_FullYearReportDefs!C:C,MATCH($B82,i_FullYearReportDefs!$B:$B,0)+i_Settings!$C$9-1))","v":"Enrollment status"},{"$f":"IF(INDEX(i_FullYearReportDefs!D:D,MATCH($B82,i_FullYearReportDefs!$B:$B,0)+i_Settings!$C$9-1)=\"\",\"\",INDEX(i_FullYearReportDefs!D:D,MATCH($B82,i_FullYearReportDefs!$B:$B,0)+i_Settings!$C$9-1))","v":"Date of Status Change"},{"$f":"IF(INDEX(i_FullYearReportDefs!E:E,MATCH($B82,i_FullYearReportDefs!$B:$B,0)+i_Settings!$C$9-1)=\"\",\"\",INDEX(i_FullYearReportDefs!E:E,MATCH($B82,i_FullYearReportDefs!$B:$B,0)+i_Settings!$C$9-1))","v":"GP1_Any att"},{"$f":"IF(INDEX(i_FullYearReportDefs!F:F,MATCH($B82,i_FullYearReportDefs!$B:$B,0)+i_Settings!$C$9-1)=\"\",\"\",INDEX(i_FullYearReportDefs!F:F,MATCH($B82,i_FullYearReportDefs!$B:$B,0)+i_Settings!$C$9-1))","v":"GP1_Any acad"},{"$f":"IF(INDEX(i_FullYearReportDefs!G:G,MATCH($B82,i_FullYearReportDefs!$B:$B,0)+i_Settings!$C$9-1)=\"\",\"\",INDEX(i_FullYearReportDefs!G:G,MATCH($B82,i_FullYearReportDefs!$B:$B,0)+i_Settings!$C$9-1))","v":"GP1_Behavior"},{"$f":"IF(INDEX(i_FullYearReportDefs!H:H,MATCH($B82,i_FullYearReportDefs!$B:$B,0)+i_Settings!$C$9-1)=\"\",\"\",INDEX(i_FullYearReportDefs!H:H,MATCH($B82,i_FullYearReportDefs!$B:$B,0)+i_Settings!$C$9-1))","v":"GP1 Interventions"},{"$f":"IF(INDEX(i_FullYearReportDefs!I:I,MATCH($B82,i_FullYearReportDefs!$B:$B,0)+i_Settings!$C$9-1)=\"\",\"\",INDEX(i_FullYearReportDefs!I:I,MATCH($B82,i_FullYearReportDefs!$B:$B,0)+i_Settings!$C$9-1))","v":"GP2_Attendance"},{"$f":"IF(INDEX(i_FullYearReportDefs!J:J,MATCH($B82,i_FullYearReportDefs!$B:$B,0)+i_Settings!$C$9-1)=\"\",\"\",INDEX(i_FullYearReportDefs!J:J,MATCH($B82,i_FullYearReportDefs!$B:$B,0)+i_Settings!$C$9-1))","v":"GP2_Any acad"},{"$f":"IF(INDEX(i_FullYearReportDefs!K:K,MATCH($B82,i_FullYearReportDefs!$B:$B,0)+i_Settings!$C$9-1)=\"\",\"\",INDEX(i_FullYearReportDefs!K:K,MATCH($B82,i_FullYearReportDefs!$B:$B,0)+i_Settings!$C$9-1))","v":"GP2_Behavior"},{"$f":"IF(INDEX(i_FullYearReportDefs!L:L,MATCH($B82,i_FullYearReportDefs!$B:$B,0)+i_Settings!$C$9-1)=\"\",\"\",INDEX(i_FullYearReportDefs!L:L,MATCH($B82,i_FullYearReportDefs!$B:$B,0)+i_Settings!$C$9-1))","v":"GP2 Interventions"},{"$f":"IF(INDEX(i_FullYearReportDefs!M:M,MATCH($B82,i_FullYearReportDefs!$B:$B,0)+i_Settings!$C$9-1)=\"\",\"\",INDEX(i_FullYearReportDefs!M:M,MATCH($B82,i_FullYearReportDefs!$B:$B,0)+i_Settings!$C$9-1))","v":"GP3_Attendance"},{"$f":"IF(INDEX(i_FullYearReportDefs!N:N,MATCH($B82,i_FullYearReportDefs!$B:$B,0)+i_Settings!$C$9-1)=\"\",\"\",INDEX(i_FullYearReportDefs!N:N,MATCH($B82,i_FullYearReportDefs!$B:$B,0)+i_Settings!$C$9-1))","v":"GP3_Any acad"},{"$f":"IF(INDEX(i_FullYearReportDefs!O:O,MATCH($B82,i_FullYearReportDefs!$B:$B,0)+i_Settings!$C$9-1)=\"\",\"\",INDEX(i_FullYearReportDefs!O:O,MATCH($B82,i_FullYearReportDefs!$B:$B,0)+i_Settings!$C$9-1))","v":"GP3_Behavior"},{"$f":"IF(INDEX(i_FullYearReportDefs!P:P,MATCH($B82,i_FullYearReportDefs!$B:$B,0)+i_Settings!$C$9-1)=\"\",\"\",INDEX(i_FullYearReportDefs!P:P,MATCH($B82,i_FullYearReportDefs!$B:$B,0)+i_Settings!$C$9-1))","v":"GP3 Interventions"},{"$f":"IF(INDEX(i_FullYearReportDefs!Q:Q,MATCH($B82,i_FullYearReportDefs!$B:$B,0)+i_Settings!$C$9-1)=\"\",\"\",INDEX(i_FullYearReportDefs!Q:Q,MATCH($B82,i_FullYearReportDefs!$B:$B,0)+i_Settings!$C$9-1))","v":"GP4_Attendance"},{"$f":"IF(INDEX(i_FullYearReportDefs!R:R,MATCH($B82,i_FullYearReportDefs!$B:$B,0)+i_Settings!$C$9-1)=\"\",\"\",INDEX(i_FullYearReportDefs!R:R,MATCH($B82,i_FullYearReportDefs!$B:$B,0)+i_Settings!$C$9-1))","v":"GP4_Any acad"},{"$f":"IF(INDEX(i_FullYearReportDefs!S:S,MATCH($B82,i_FullYearReportDefs!$B:$B,0)+i_Settings!$C$9-1)=\"\",\"\",INDEX(i_FullYearReportDefs!S:S,MATCH($B82,i_FullYearReportDefs!$B:$B,0)+i_Settings!$C$9-1))","v":"GP4_Behavior"},{"$f":"IF(INDEX(i_FullYearReportDefs!T:T,MATCH($B82,i_FullYearReportDefs!$B:$B,0)+i_Settings!$C$9-1)=\"\",\"\",INDEX(i_FullYearReportDefs!T:T,MATCH($B82,i_FullYearReportDefs!$B:$B,0)+i_Settings!$C$9-1))","v":"GP4 Interventions"},{"$f":"IF(INDEX(i_FullYearReportDefs!U:U,MATCH($B82,i_FullYearReportDefs!$B:$B,0)+i_Settings!$C$9-1)=\"\",\"\",INDEX(i_FullYearReportDefs!U:U,MATCH($B82,i_FullYearReportDefs!$B:$B,0)+i_Settings!$C$9-1))","v":"eoy_Attendance"},{"$f":"IF(INDEX(i_FullYearReportDefs!V:V,MATCH($B82,i_FullYearReportDefs!$B:$B,0)+i_Settings!$C$9-1)=\"\",\"\",INDEX(i_FullYearReportDefs!V:V,MATCH($B82,i_FullYearReportDefs!$B:$B,0)+i_Settings!$C$9-1))","v":"eoy_Any acad"},{"$f":"IF(INDEX(i_FullYearReportDefs!W:W,MATCH($B82,i_FullYearReportDefs!$B:$B,0)+i_Settings!$C$9-1)=\"\",\"\",INDEX(i_FullYearReportDefs!W:W,MATCH($B82,i_FullYearReportDefs!$B:$B,0)+i_Settings!$C$9-1))","v":"eoy_Behavior"},{"$f":"IF(INDEX(i_FullYearReportDefs!X:X,MATCH($B82,i_FullYearReportDefs!$B:$B,0)+i_Settings!$C$9-1)=\"\",\"\",INDEX(i_FullYearReportDefs!X:X,MATCH($B82,i_FullYearReportDefs!$B:$B,0)+i_Settings!$C$9-1))","v":""},{"$f":"IF(INDEX(i_FullYearReportDefs!Y:Y,MATCH($B82,i_FullYearReportDefs!$B:$B,0)+i_Settings!$C$9-1)=\"\",\"\",INDEX(i_FullYearReportDefs!Y:Y,MATCH($B82,i_FullYearReportDefs!$B:$B,0)+i_Settings!$C$9-1))","v":""},{"$f":"IF(INDEX(i_FullYearReportDefs!Z:Z,MATCH($B82,i_FullYearReportDefs!$B:$B,0)+i_Settings!$C$9-1)=\"\",\"\",INDEX(i_FullYearReportDefs!Z:Z,MATCH($B82,i_FullYearReportDefs!$B:$B,0)+i_Settings!$C$9-1))","v":""}]
[null,"FullStudent transfers","Student ID","First Name","Last Name",{"$f":"IF(INDEX(i_FullYearReportDefs!C:C,MATCH($B83,i_FullYearReportDefs!$B:$B,0)+i_Settings!$C$9-1)=\"\",\"\",INDEX(i_FullYearReportDefs!C:C,MATCH($B83,i_FullYearReportDefs!$B:$B,0)+i_Settings!$C$9-1))","v":"Enrollment status"},{"$f":"IF(INDEX(i_FullYearReportDefs!D:D,MATCH($B83,i_FullYearReportDefs!$B:$B,0)+i_Settings!$C$9-1)=\"\",\"\",INDEX(i_FullYearReportDefs!D:D,MATCH($B83,i_FullYearReportDefs!$B:$B,0)+i_Settings!$C$9-1))","v":"Date of Status Change"},{"$f":"IF(INDEX(i_FullYearReportDefs!E:E,MATCH($B83,i_FullYearReportDefs!$B:$B,0)+i_Settings!$C$9-1)=\"\",\"\",INDEX(i_FullYearReportDefs!E:E,MATCH($B83,i_FullYearReportDefs!$B:$B,0)+i_Settings!$C$9-1))","v":"GP1_Any att"},{"$f":"IF(INDEX(i_FullYearReportDefs!F:F,MATCH($B83,i_FullYearReportDefs!$B:$B,0)+i_Settings!$C$9-1)=\"\",\"\",INDEX(i_FullYearReportDefs!F:F,MATCH($B83,i_FullYearReportDefs!$B:$B,0)+i_Settings!$C$9-1))","v":"GP1_Any acad"},{"$f":"IF(INDEX(i_FullYearReportDefs!G:G,MATCH($B83,i_FullYearReportDefs!$B:$B,0)+i_Settings!$C$9-1)=\"\",\"\",INDEX(i_FullYearReportDefs!G:G,MATCH($B83,i_FullYearReportDefs!$B:$B,0)+i_Settings!$C$9-1))","v":"GP1_Behavior"},{"$f":"IF(INDEX(i_FullYearReportDefs!H:H,MATCH($B83,i_FullYearReportDefs!$B:$B,0)+i_Settings!$C$9-1)=\"\",\"\",INDEX(i_FullYearReportDefs!H:H,MATCH($B83,i_FullYearReportDefs!$B:$B,0)+i_Settings!$C$9-1))","v":"GP2_Attendance"},{"$f":"IF(INDEX(i_FullYearReportDefs!I:I,MATCH($B83,i_FullYearReportDefs!$B:$B,0)+i_Settings!$C$9-1)=\"\",\"\",INDEX(i_FullYearReportDefs!I:I,MATCH($B83,i_FullYearReportDefs!$B:$B,0)+i_Settings!$C$9-1))","v":"GP2_Any acad"},{"$f":"IF(INDEX(i_FullYearReportDefs!J:J,MATCH($B83,i_FullYearReportDefs!$B:$B,0)+i_Settings!$C$9-1)=\"\",\"\",INDEX(i_FullYearReportDefs!J:J,MATCH($B83,i_FullYearReportDefs!$B:$B,0)+i_Settings!$C$9-1))","v":"GP2_Behavior"},{"$f":"IF(INDEX(i_FullYearReportDefs!K:K,MATCH($B83,i_FullYearReportDefs!$B:$B,0)+i_Settings!$C$9-1)=\"\",\"\",INDEX(i_FullYearReportDefs!K:K,MATCH($B83,i_FullYearReportDefs!$B:$B,0)+i_Settings!$C$9-1))","v":"GP3_Attendance"},{"$f":"IF(INDEX(i_FullYearReportDefs!L:L,MATCH($B83,i_FullYearReportDefs!$B:$B,0)+i_Settings!$C$9-1)=\"\",\"\",INDEX(i_FullYearReportDefs!L:L,MATCH($B83,i_FullYearReportDefs!$B:$B,0)+i_Settings!$C$9-1))","v":"GP3_Any acad"},{"$f":"IF(INDEX(i_FullYearReportDefs!M:M,MATCH($B83,i_FullYearReportDefs!$B:$B,0)+i_Settings!$C$9-1)=\"\",\"\",INDEX(i_FullYearReportDefs!M:M,MATCH($B83,i_FullYearReportDefs!$B:$B,0)+i_Settings!$C$9-1))","v":"GP3_Behavior"},{"$f":"IF(INDEX(i_FullYearReportDefs!N:N,MATCH($B83,i_FullYearReportDefs!$B:$B,0)+i_Settings!$C$9-1)=\"\",\"\",INDEX(i_FullYearReportDefs!N:N,MATCH($B83,i_FullYearReportDefs!$B:$B,0)+i_Settings!$C$9-1))","v":"GP4_Attendance"},{"$f":"IF(INDEX(i_FullYearReportDefs!O:O,MATCH($B83,i_FullYearReportDefs!$B:$B,0)+i_Settings!$C$9-1)=\"\",\"\",INDEX(i_FullYearReportDefs!O:O,MATCH($B83,i_FullYearReportDefs!$B:$B,0)+i_Settings!$C$9-1))","v":"GP4_Any acad"},{"$f":"IF(INDEX(i_FullYearReportDefs!P:P,MATCH($B83,i_FullYearReportDefs!$B:$B,0)+i_Settings!$C$9-1)=\"\",\"\",INDEX(i_FullYearReportDefs!P:P,MATCH($B83,i_FullYearReportDefs!$B:$B,0)+i_Settings!$C$9-1))","v":"GP4_Behavior"},{"$f":"IF(INDEX(i_FullYearReportDefs!Q:Q,MATCH($B83,i_FullYearReportDefs!$B:$B,0)+i_Settings!$C$9-1)=\"\",\"\",INDEX(i_FullYearReportDefs!Q:Q,MATCH($B83,i_FullYearReportDefs!$B:$B,0)+i_Settings!$C$9-1))","v":"eoy_Attendance"},{"$f":"IF(INDEX(i_FullYearReportDefs!R:R,MATCH($B83,i_FullYearReportDefs!$B:$B,0)+i_Settings!$C$9-1)=\"\",\"\",INDEX(i_FullYearReportDefs!R:R,MATCH($B83,i_FullYearReportDefs!$B:$B,0)+i_Settings!$C$9-1))","v":"eoy_Any acad"},{"$f":"IF(INDEX(i_FullYearReportDefs!S:S,MATCH($B83,i_FullYearReportDefs!$B:$B,0)+i_Settings!$C$9-1)=\"\",\"\",INDEX(i_FullYearReportDefs!S:S,MATCH($B83,i_FullYearReportDefs!$B:$B,0)+i_Settings!$C$9-1))","v":"eoy_Behavior"},{"$f":"IF(INDEX(i_FullYearReportDefs!T:T,MATCH($B83,i_FullYearReportDefs!$B:$B,0)+i_Settings!$C$9-1)=\"\",\"\",INDEX(i_FullYearReportDefs!T:T,MATCH($B83,i_FullYearReportDefs!$B:$B,0)+i_Settings!$C$9-1))","v":"eoy_Behavior"},{"$f":"IF(INDEX(i_FullYearReportDefs!U:U,MATCH($B83,i_FullYearReportDefs!$B:$B,0)+i_Settings!$C$9-1)=\"\",\"\",INDEX(i_FullYearReportDefs!U:U,MATCH($B83,i_FullYearReportDefs!$B:$B,0)+i_Settings!$C$9-1))","v":""},{"$f":"IF(INDEX(i_FullYearReportDefs!V:V,MATCH($B83,i_FullYearReportDefs!$B:$B,0)+i_Settings!$C$9-1)=\"\",\"\",INDEX(i_FullYearReportDefs!V:V,MATCH($B83,i_FullYearReportDefs!$B:$B,0)+i_Settings!$C$9-1))","v":""},{"$f":"IF(INDEX(i_FullYearReportDefs!W:W,MATCH($B83,i_FullYearReportDefs!$B:$B,0)+i_Settings!$C$9-1)=\"\",\"\",INDEX(i_FullYearReportDefs!W:W,MATCH($B83,i_FullYearReportDefs!$B:$B,0)+i_Settings!$C$9-1))","v":""},{"$f":"IF(INDEX(i_FullYearReportDefs!X:X,MATCH($B83,i_FullYearReportDefs!$B:$B,0)+i_Settings!$C$9-1)=\"\",\"\",INDEX(i_FullYearReportDefs!X:X,MATCH($B83,i_FullYearReportDefs!$B:$B,0)+i_Settings!$C$9-1))","v":""},{"$f":"IF(INDEX(i_FullYearReportDefs!Y:Y,MATCH($B83,i_FullYearReportDefs!$B:$B,0)+i_Settings!$C$9-1)=\"\",\"\",INDEX(i_FullYearReportDefs!Y:Y,MATCH($B83,i_FullYearReportDefs!$B:$B,0)+i_Settings!$C$9-1))","v":""},{"$f":"IF(INDEX(i_FullYearReportDefs!Z:Z,MATCH($B83,i_FullYearReportDefs!$B:$B,0)+i_Settings!$C$9-1)=\"\",\"\",INDEX(i_FullYearReportDefs!Z:Z,MATCH($B83,i_FullYearReportDefs!$B:$B,0)+i_Settings!$C$9-1))","v":""}]
[null,"FullIncoming Indicator of Risk Transition Report","Student ID","First Name","Last Name",{"$f":"IF(INDEX(i_FullYearReportDefs!C:C,MATCH($B84,i_FullYearReportDefs!$B:$B,0)+i_Settings!$C$9-1)=\"\",\"\",INDEX(i_FullYearReportDefs!C:C,MATCH($B84,i_FullYearReportDefs!$B:$B,0)+i_Settings!$C$9-1))","v":"Pre-HS indicator"},{"$f":"IF(INDEX(i_FullYearReportDefs!D:D,MATCH($B84,i_FullYearReportDefs!$B:$B,0)+i_Settings!$C$9-1)=\"\",\"\",INDEX(i_FullYearReportDefs!D:D,MATCH($B84,i_FullYearReportDefs!$B:$B,0)+i_Settings!$C$9-1))","v":"GP1_Any att"},{"$f":"IF(INDEX(i_FullYearReportDefs!E:E,MATCH($B84,i_FullYearReportDefs!$B:$B,0)+i_Settings!$C$9-1)=\"\",\"\",INDEX(i_FullYearReportDefs!E:E,MATCH($B84,i_FullYearReportDefs!$B:$B,0)+i_Settings!$C$9-1))","v":"GP1_Any acad"},{"$f":"IF(INDEX(i_FullYearReportDefs!F:F,MATCH($B84,i_FullYearReportDefs!$B:$B,0)+i_Settings!$C$9-1)=\"\",\"\",INDEX(i_FullYearReportDefs!F:F,MATCH($B84,i_FullYearReportDefs!$B:$B,0)+i_Settings!$C$9-1))","v":"GP1_Behavior"},{"$f":"IF(INDEX(i_FullYearReportDefs!G:G,MATCH($B84,i_FullYearReportDefs!$B:$B,0)+i_Settings!$C$9-1)=\"\",\"\",INDEX(i_FullYearReportDefs!G:G,MATCH($B84,i_FullYearReportDefs!$B:$B,0)+i_Settings!$C$9-1))","v":"GP1 Interventions"},{"$f":"IF(INDEX(i_FullYearReportDefs!H:H,MATCH($B84,i_FullYearReportDefs!$B:$B,0)+i_Settings!$C$9-1)=\"\",\"\",INDEX(i_FullYearReportDefs!H:H,MATCH($B84,i_FullYearReportDefs!$B:$B,0)+i_Settings!$C$9-1))","v":"GP2_Attendance"},{"$f":"IF(INDEX(i_FullYearReportDefs!I:I,MATCH($B84,i_FullYearReportDefs!$B:$B,0)+i_Settings!$C$9-1)=\"\",\"\",INDEX(i_FullYearReportDefs!I:I,MATCH($B84,i_FullYearReportDefs!$B:$B,0)+i_Settings!$C$9-1))","v":"GP2_Any acad"},{"$f":"IF(INDEX(i_FullYearReportDefs!J:J,MATCH($B84,i_FullYearReportDefs!$B:$B,0)+i_Settings!$C$9-1)=\"\",\"\",INDEX(i_FullYearReportDefs!J:J,MATCH($B84,i_FullYearReportDefs!$B:$B,0)+i_Settings!$C$9-1))","v":"GP2_Behavior"},{"$f":"IF(INDEX(i_FullYearReportDefs!K:K,MATCH($B84,i_FullYearReportDefs!$B:$B,0)+i_Settings!$C$9-1)=\"\",\"\",INDEX(i_FullYearReportDefs!K:K,MATCH($B84,i_FullYearReportDefs!$B:$B,0)+i_Settings!$C$9-1))","v":"GP2 Interventions"},{"$f":"IF(INDEX(i_FullYearReportDefs!L:L,MATCH($B84,i_FullYearReportDefs!$B:$B,0)+i_Settings!$C$9-1)=\"\",\"\",INDEX(i_FullYearReportDefs!L:L,MATCH($B84,i_FullYearReportDefs!$B:$B,0)+i_Settings!$C$9-1))","v":"GP3_Attendance"},{"$f":"IF(INDEX(i_FullYearReportDefs!M:M,MATCH($B84,i_FullYearReportDefs!$B:$B,0)+i_Settings!$C$9-1)=\"\",\"\",INDEX(i_FullYearReportDefs!M:M,MATCH($B84,i_FullYearReportDefs!$B:$B,0)+i_Settings!$C$9-1))","v":"GP3_Any acad"},{"$f":"IF(INDEX(i_FullYearReportDefs!N:N,MATCH($B84,i_FullYearReportDefs!$B:$B,0)+i_Settings!$C$9-1)=\"\",\"\",INDEX(i_FullYearReportDefs!N:N,MATCH($B84,i_FullYearReportDefs!$B:$B,0)+i_Settings!$C$9-1))","v":"GP3_Behavior"},{"$f":"IF(INDEX(i_FullYearReportDefs!O:O,MATCH($B84,i_FullYearReportDefs!$B:$B,0)+i_Settings!$C$9-1)=\"\",\"\",INDEX(i_FullYearReportDefs!O:O,MATCH($B84,i_FullYearReportDefs!$B:$B,0)+i_Settings!$C$9-1))","v":"GP3 Interventions"},{"$f":"IF(INDEX(i_FullYearReportDefs!P:P,MATCH($B84,i_FullYearReportDefs!$B:$B,0)+i_Settings!$C$9-1)=\"\",\"\",INDEX(i_FullYearReportDefs!P:P,MATCH($B84,i_FullYearReportDefs!$B:$B,0)+i_Settings!$C$9-1))","v":"GP4_Attendance"},{"$f":"IF(INDEX(i_FullYearReportDefs!Q:Q,MATCH($B84,i_FullYearReportDefs!$B:$B,0)+i_Settings!$C$9-1)=\"\",\"\",INDEX(i_FullYearReportDefs!Q:Q,MATCH($B84,i_FullYearReportDefs!$B:$B,0)+i_Settings!$C$9-1))","v":"GP4_Any acad"},{"$f":"IF(INDEX(i_FullYearReportDefs!R:R,MATCH($B84,i_FullYearReportDefs!$B:$B,0)+i_Settings!$C$9-1)=\"\",\"\",INDEX(i_FullYearReportDefs!R:R,MATCH($B84,i_FullYearReportDefs!$B:$B,0)+i_Settings!$C$9-1))","v":"GP4 Interventions"},{"$f":"IF(INDEX(i_FullYearReportDefs!S:S,MATCH($B84,i_FullYearReportDefs!$B:$B,0)+i_Settings!$C$9-1)=\"\",\"\",INDEX(i_FullYearReportDefs!S:S,MATCH($B84,i_FullYearReportDefs!$B:$B,0)+i_Settings!$C$9-1))","v":"GP4_Behavior"},{"$f":"IF(INDEX(i_FullYearReportDefs!T:T,MATCH($B84,i_FullYearReportDefs!$B:$B,0)+i_Settings!$C$9-1)=\"\",\"\",INDEX(i_FullYearReportDefs!T:T,MATCH($B84,i_FullYearReportDefs!$B:$B,0)+i_Settings!$C$9-1))","v":"eoy_Attendance"},{"$f":"IF(INDEX(i_FullYearReportDefs!U:U,MATCH($B84,i_FullYearReportDefs!$B:$B,0)+i_Settings!$C$9-1)=\"\",\"\",INDEX(i_FullYearReportDefs!U:U,MATCH($B84,i_FullYearReportDefs!$B:$B,0)+i_Settings!$C$9-1))","v":"eoy_Any acad"},{"$f":"IF(INDEX(i_FullYearReportDefs!V:V,MATCH($B84,i_FullYearReportDefs!$B:$B,0)+i_Settings!$C$9-1)=\"\",\"\",INDEX(i_FullYearReportDefs!V:V,MATCH($B84,i_FullYearReportDefs!$B:$B,0)+i_Settings!$C$9-1))","v":"eoy_Behavior"},{"$f":"IF(INDEX(i_FullYearReportDefs!W:W,MATCH($B84,i_FullYearReportDefs!$B:$B,0)+i_Settings!$C$9-1)=\"\",\"\",INDEX(i_FullYearReportDefs!W:W,MATCH($B84,i_FullYearReportDefs!$B:$B,0)+i_Settings!$C$9-1))","v":""},{"$f":"IF(INDEX(i_FullYearReportDefs!X:X,MATCH($B84,i_FullYearReportDefs!$B:$B,0)+i_Settings!$C$9-1)=\"\",\"\",INDEX(i_FullYearReportDefs!X:X,MATCH($B84,i_FullYearReportDefs!$B:$B,0)+i_Settings!$C$9-1))","v":""},{"$f":"IF(INDEX(i_FullYearReportDefs!Y:Y,MATCH($B84,i_FullYearReportDefs!$B:$B,0)+i_Settings!$C$9-1)=\"\",\"\",INDEX(i_FullYearReportDefs!Y:Y,MATCH($B84,i_FullYearReportDefs!$B:$B,0)+i_Settings!$C$9-1))","v":""},{"$f":"IF(INDEX(i_FullYearReportDefs!Z:Z,MATCH($B84,i_FullYearReportDefs!$B:$B,0)+i_Settings!$C$9-1)=\"\",\"\",INDEX(i_FullYearReportDefs!Z:Z,MATCH($B84,i_FullYearReportDefs!$B:$B,0)+i_Settings!$C$9-1))","v":""}]
[null,"FullOn- to off-track report","Student ID","First Name","Last Name",{"$f":"IF(INDEX(i_FullYearReportDefs!C:C,MATCH($B85,i_FullYearReportDefs!$B:$B,0)+i_Settings!$C$9-1)=\"\",\"\",INDEX(i_FullYearReportDefs!C:C,MATCH($B85,i_FullYearReportDefs!$B:$B,0)+i_Settings!$C$9-1))","v":"Pre-HS indicator"},{"$f":"IF(INDEX(i_FullYearReportDefs!D:D,MATCH($B85,i_FullYearReportDefs!$B:$B,0)+i_Settings!$C$9-1)=\"\",\"\",INDEX(i_FullYearReportDefs!D:D,MATCH($B85,i_FullYearReportDefs!$B:$B,0)+i_Settings!$C$9-1))","v":"GP1_Any att"},{"$f":"IF(INDEX(i_FullYearReportDefs!E:E,MATCH($B85,i_FullYearReportDefs!$B:$B,0)+i_Settings!$C$9-1)=\"\",\"\",INDEX(i_FullYearReportDefs!E:E,MATCH($B85,i_FullYearReportDefs!$B:$B,0)+i_Settings!$C$9-1))","v":"GP1_Any acad"},{"$f":"IF(INDEX(i_FullYearReportDefs!F:F,MATCH($B85,i_FullYearReportDefs!$B:$B,0)+i_Settings!$C$9-1)=\"\",\"\",INDEX(i_FullYearReportDefs!F:F,MATCH($B85,i_FullYearReportDefs!$B:$B,0)+i_Settings!$C$9-1))","v":"GP1_Behavior"},{"$f":"IF(INDEX(i_FullYearReportDefs!G:G,MATCH($B85,i_FullYearReportDefs!$B:$B,0)+i_Settings!$C$9-1)=\"\",\"\",INDEX(i_FullYearReportDefs!G:G,MATCH($B85,i_FullYearReportDefs!$B:$B,0)+i_Settings!$C$9-1))","v":"GP1 Interventions"},{"$f":"IF(INDEX(i_FullYearReportDefs!H:H,MATCH($B85,i_FullYearReportDefs!$B:$B,0)+i_Settings!$C$9-1)=\"\",\"\",INDEX(i_FullYearReportDefs!H:H,MATCH($B85,i_FullYearReportDefs!$B:$B,0)+i_Settings!$C$9-1))","v":"GP2_Attendance"},{"$f":"IF(INDEX(i_FullYearReportDefs!I:I,MATCH($B85,i_FullYearReportDefs!$B:$B,0)+i_Settings!$C$9-1)=\"\",\"\",INDEX(i_FullYearReportDefs!I:I,MATCH($B85,i_FullYearReportDefs!$B:$B,0)+i_Settings!$C$9-1))","v":"GP2_Any acad"},{"$f":"IF(INDEX(i_FullYearReportDefs!J:J,MATCH($B85,i_FullYearReportDefs!$B:$B,0)+i_Settings!$C$9-1)=\"\",\"\",INDEX(i_FullYearReportDefs!J:J,MATCH($B85,i_FullYearReportDefs!$B:$B,0)+i_Settings!$C$9-1))","v":"GP2_Behavior"},{"$f":"IF(INDEX(i_FullYearReportDefs!K:K,MATCH($B85,i_FullYearReportDefs!$B:$B,0)+i_Settings!$C$9-1)=\"\",\"\",INDEX(i_FullYearReportDefs!K:K,MATCH($B85,i_FullYearReportDefs!$B:$B,0)+i_Settings!$C$9-1))","v":"GP2 Interventions"},{"$f":"IF(INDEX(i_FullYearReportDefs!L:L,MATCH($B85,i_FullYearReportDefs!$B:$B,0)+i_Settings!$C$9-1)=\"\",\"\",INDEX(i_FullYearReportDefs!L:L,MATCH($B85,i_FullYearReportDefs!$B:$B,0)+i_Settings!$C$9-1))","v":"GP3_Attendance"},{"$f":"IF(INDEX(i_FullYearReportDefs!M:M,MATCH($B85,i_FullYearReportDefs!$B:$B,0)+i_Settings!$C$9-1)=\"\",\"\",INDEX(i_FullYearReportDefs!M:M,MATCH($B85,i_FullYearReportDefs!$B:$B,0)+i_Settings!$C$9-1))","v":"GP3_Any acad"},{"$f":"IF(INDEX(i_FullYearReportDefs!N:N,MATCH($B85,i_FullYearReportDefs!$B:$B,0)+i_Settings!$C$9-1)=\"\",\"\",INDEX(i_FullYearReportDefs!N:N,MATCH($B85,i_FullYearReportDefs!$B:$B,0)+i_Settings!$C$9-1))","v":"GP3_Behavior"},{"$f":"IF(INDEX(i_FullYearReportDefs!O:O,MATCH($B85,i_FullYearReportDefs!$B:$B,0)+i_Settings!$C$9-1)=\"\",\"\",INDEX(i_FullYearReportDefs!O:O,MATCH($B85,i_FullYearReportDefs!$B:$B,0)+i_Settings!$C$9-1))","v":"GP3 Interventions"},{"$f":"IF(INDEX(i_FullYearReportDefs!P:P,MATCH($B85,i_FullYearReportDefs!$B:$B,0)+i_Settings!$C$9-1)=\"\",\"\",INDEX(i_FullYearReportDefs!P:P,MATCH($B85,i_FullYearReportDefs!$B:$B,0)+i_Settings!$C$9-1))","v":"GP4_Attendance"},{"$f":"IF(INDEX(i_FullYearReportDefs!Q:Q,MATCH($B85,i_FullYearReportDefs!$B:$B,0)+i_Settings!$C$9-1)=\"\",\"\",INDEX(i_FullYearReportDefs!Q:Q,MATCH($B85,i_FullYearReportDefs!$B:$B,0)+i_Settings!$C$9-1))","v":"GP4_Any acad"},{"$f":"IF(INDEX(i_FullYearReportDefs!R:R,MATCH($B85,i_FullYearReportDefs!$B:$B,0)+i_Settings!$C$9-1)=\"\",\"\",INDEX(i_FullYearReportDefs!R:R,MATCH($B85,i_FullYearReportDefs!$B:$B,0)+i_Settings!$C$9-1))","v":"GP4 Interventions"},{"$f":"IF(INDEX(i_FullYearReportDefs!S:S,MATCH($B85,i_FullYearReportDefs!$B:$B,0)+i_Settings!$C$9-1)=\"\",\"\",INDEX(i_FullYearReportDefs!S:S,MATCH($B85,i_FullYearReportDefs!$B:$B,0)+i_Settings!$C$9-1))","v":"GP4_Behavior"},{"$f":"IF(INDEX(i_FullYearReportDefs!T:T,MATCH($B85,i_FullYearReportDefs!$B:$B,0)+i_Settings!$C$9-1)=\"\",\"\",INDEX(i_FullYearReportDefs!T:T,MATCH($B85,i_FullYearReportDefs!$B:$B,0)+i_Settings!$C$9-1))","v":"eoy_Attendance"},{"$f":"IF(INDEX(i_FullYearReportDefs!U:U,MATCH($B85,i_FullYearReportDefs!$B:$B,0)+i_Settings!$C$9-1)=\"\",\"\",INDEX(i_FullYearReportDefs!U:U,MATCH($B85,i_FullYearReportDefs!$B:$B,0)+i_Settings!$C$9-1))","v":"eoy_Any acad"},{"$f":"IF(INDEX(i_FullYearReportDefs!V:V,MATCH($B85,i_FullYearReportDefs!$B:$B,0)+i_Settings!$C$9-1)=\"\",\"\",INDEX(i_FullYearReportDefs!V:V,MATCH($B85,i_FullYearReportDefs!$B:$B,0)+i_Settings!$C$9-1))","v":"eoy_Behavior"},{"$f":"IF(INDEX(i_FullYearReportDefs!W:W,MATCH($B85,i_FullYearReportDefs!$B:$B,0)+i_Settings!$C$9-1)=\"\",\"\",INDEX(i_FullYearReportDefs!W:W,MATCH($B85,i_FullYearReportDefs!$B:$B,0)+i_Settings!$C$9-1))","v":""},{"$f":"IF(INDEX(i_FullYearReportDefs!X:X,MATCH($B85,i_FullYearReportDefs!$B:$B,0)+i_Settings!$C$9-1)=\"\",\"\",INDEX(i_FullYearReportDefs!X:X,MATCH($B85,i_FullYearReportDefs!$B:$B,0)+i_Settings!$C$9-1))","v":""},{"$f":"IF(INDEX(i_FullYearReportDefs!Y:Y,MATCH($B85,i_FullYearReportDefs!$B:$B,0)+i_Settings!$C$9-1)=\"\",\"\",INDEX(i_FullYearReportDefs!Y:Y,MATCH($B85,i_FullYearReportDefs!$B:$B,0)+i_Settings!$C$9-1))","v":""},{"$f":"IF(INDEX(i_FullYearReportDefs!Z:Z,MATCH($B85,i_FullYearReportDefs!$B:$B,0)+i_Settings!$C$9-1)=\"\",\"\",INDEX(i_FullYearReportDefs!Z:Z,MATCH($B85,i_FullYearReportDefs!$B:$B,0)+i_Settings!$C$9-1))","v":""}]
[null,"FullOff- to on-track report","Student ID","First Name","Last Name",{"$f":"IF(INDEX(i_FullYearReportDefs!C:C,MATCH($B86,i_FullYearReportDefs!$B:$B,0)+i_Settings!$C$9-1)=\"\",\"\",INDEX(i_FullYearReportDefs!C:C,MATCH($B86,i_FullYearReportDefs!$B:$B,0)+i_Settings!$C$9-1))","v":"Pre-HS indicator"},{"$f":"IF(INDEX(i_FullYearReportDefs!D:D,MATCH($B86,i_FullYearReportDefs!$B:$B,0)+i_Settings!$C$9-1)=\"\",\"\",INDEX(i_FullYearReportDefs!D:D,MATCH($B86,i_FullYearReportDefs!$B:$B,0)+i_Settings!$C$9-1))","v":"GP1_Any att"},{"$f":"IF(INDEX(i_FullYearReportDefs!E:E,MATCH($B86,i_FullYearReportDefs!$B:$B,0)+i_Settings!$C$9-1)=\"\",\"\",INDEX(i_FullYearReportDefs!E:E,MATCH($B86,i_FullYearReportDefs!$B:$B,0)+i_Settings!$C$9-1))","v":"GP1_Any acad"},{"$f":"IF(INDEX(i_FullYearReportDefs!F:F,MATCH($B86,i_FullYearReportDefs!$B:$B,0)+i_Settings!$C$9-1)=\"\",\"\",INDEX(i_FullYearReportDefs!F:F,MATCH($B86,i_FullYearReportDefs!$B:$B,0)+i_Settings!$C$9-1))","v":"GP1_Behavior"},{"$f":"IF(INDEX(i_FullYearReportDefs!G:G,MATCH($B86,i_FullYearReportDefs!$B:$B,0)+i_Settings!$C$9-1)=\"\",\"\",INDEX(i_FullYearReportDefs!G:G,MATCH($B86,i_FullYearReportDefs!$B:$B,0)+i_Settings!$C$9-1))","v":"GP1 Interventions"},{"$f":"IF(INDEX(i_FullYearReportDefs!H:H,MATCH($B86,i_FullYearReportDefs!$B:$B,0)+i_Settings!$C$9-1)=\"\",\"\",INDEX(i_FullYearReportDefs!H:H,MATCH($B86,i_FullYearReportDefs!$B:$B,0)+i_Settings!$C$9-1))","v":"GP2_Attendance"},{"$f":"IF(INDEX(i_FullYearReportDefs!I:I,MATCH($B86,i_FullYearReportDefs!$B:$B,0)+i_Settings!$C$9-1)=\"\",\"\",INDEX(i_FullYearReportDefs!I:I,MATCH($B86,i_FullYearReportDefs!$B:$B,0)+i_Settings!$C$9-1))","v":"GP2_Any acad"},{"$f":"IF(INDEX(i_FullYearReportDefs!J:J,MATCH($B86,i_FullYearReportDefs!$B:$B,0)+i_Settings!$C$9-1)=\"\",\"\",INDEX(i_FullYearReportDefs!J:J,MATCH($B86,i_FullYearReportDefs!$B:$B,0)+i_Settings!$C$9-1))","v":"GP2_Behavior"},{"$f":"IF(INDEX(i_FullYearReportDefs!K:K,MATCH($B86,i_FullYearReportDefs!$B:$B,0)+i_Settings!$C$9-1)=\"\",\"\",INDEX(i_FullYearReportDefs!K:K,MATCH($B86,i_FullYearReportDefs!$B:$B,0)+i_Settings!$C$9-1))","v":"GP2 Interventions"},{"$f":"IF(INDEX(i_FullYearReportDefs!L:L,MATCH($B86,i_FullYearReportDefs!$B:$B,0)+i_Settings!$C$9-1)=\"\",\"\",INDEX(i_FullYearReportDefs!L:L,MATCH($B86,i_FullYearReportDefs!$B:$B,0)+i_Settings!$C$9-1))","v":"GP3_Attendance"},{"$f":"IF(INDEX(i_FullYearReportDefs!M:M,MATCH($B86,i_FullYearReportDefs!$B:$B,0)+i_Settings!$C$9-1)=\"\",\"\",INDEX(i_FullYearReportDefs!M:M,MATCH($B86,i_FullYearReportDefs!$B:$B,0)+i_Settings!$C$9-1))","v":"GP3_Any acad"},{"$f":"IF(INDEX(i_FullYearReportDefs!N:N,MATCH($B86,i_FullYearReportDefs!$B:$B,0)+i_Settings!$C$9-1)=\"\",\"\",INDEX(i_FullYearReportDefs!N:N,MATCH($B86,i_FullYearReportDefs!$B:$B,0)+i_Settings!$C$9-1))","v":"GP3_Behavior"},{"$f":"IF(INDEX(i_FullYearReportDefs!O:O,MATCH($B86,i_FullYearReportDefs!$B:$B,0)+i_Settings!$C$9-1)=\"\",\"\",INDEX(i_FullYearReportDefs!O:O,MATCH($B86,i_FullYearReportDefs!$B:$B,0)+i_Settings!$C$9-1))","v":"GP3 Interventions"},{"$f":"IF(INDEX(i_FullYearReportDefs!P:P,MATCH($B86,i_FullYearReportDefs!$B:$B,0)+i_Settings!$C$9-1)=\"\",\"\",INDEX(i_FullYearReportDefs!P:P,MATCH($B86,i_FullYearReportDefs!$B:$B,0)+i_Settings!$C$9-1))","v":"GP4_Attendance"},{"$f":"IF(INDEX(i_FullYearReportDefs!Q:Q,MATCH($B86,i_FullYearReportDefs!$B:$B,0)+i_Settings!$C$9-1)=\"\",\"\",INDEX(i_FullYearReportDefs!Q:Q,MATCH($B86,i_FullYearReportDefs!$B:$B,0)+i_Settings!$C$9-1))","v":"GP4_Any acad"},{"$f":"IF(INDEX(i_FullYearReportDefs!R:R,MATCH($B86,i_FullYearReportDefs!$B:$B,0)+i_Settings!$C$9-1)=\"\",\"\",INDEX(i_FullYearReportDefs!R:R,MATCH($B86,i_FullYearReportDefs!$B:$B,0)+i_Settings!$C$9-1))","v":"GP4 Interventions"},{"$f":"IF(INDEX(i_FullYearReportDefs!S:S,MATCH($B86,i_FullYearReportDefs!$B:$B,0)+i_Settings!$C$9-1)=\"\",\"\",INDEX(i_FullYearReportDefs!S:S,MATCH($B86,i_FullYearReportDefs!$B:$B,0)+i_Settings!$C$9-1))","v":"GP4_Behavior"},{"$f":"IF(INDEX(i_FullYearReportDefs!T:T,MATCH($B86,i_FullYearReportDefs!$B:$B,0)+i_Settings!$C$9-1)=\"\",\"\",INDEX(i_FullYearReportDefs!T:T,MATCH($B86,i_FullYearReportDefs!$B:$B,0)+i_Settings!$C$9-1))","v":"eoy_Attendance"},{"$f":"IF(INDEX(i_FullYearReportDefs!U:U,MATCH($B86,i_FullYearReportDefs!$B:$B,0)+i_Settings!$C$9-1)=\"\",\"\",INDEX(i_FullYearReportDefs!U:U,MATCH($B86,i_FullYearReportDefs!$B:$B,0)+i_Settings!$C$9-1))","v":"eoy_Any acad"},{"$f":"IF(INDEX(i_FullYearReportDefs!V:V,MATCH($B86,i_FullYearReportDefs!$B:$B,0)+i_Settings!$C$9-1)=\"\",\"\",INDEX(i_FullYearReportDefs!V:V,MATCH($B86,i_FullYearReportDefs!$B:$B,0)+i_Settings!$C$9-1))","v":"eoy_Behavior"},{"$f":"IF(INDEX(i_FullYearReportDefs!W:W,MATCH($B86,i_FullYearReportDefs!$B:$B,0)+i_Settings!$C$9-1)=\"\",\"\",INDEX(i_FullYearReportDefs!W:W,MATCH($B86,i_FullYearReportDefs!$B:$B,0)+i_Settings!$C$9-1))","v":""},{"$f":"IF(INDEX(i_FullYearReportDefs!X:X,MATCH($B86,i_FullYearReportDefs!$B:$B,0)+i_Settings!$C$9-1)=\"\",\"\",INDEX(i_FullYearReportDefs!X:X,MATCH($B86,i_FullYearReportDefs!$B:$B,0)+i_Settings!$C$9-1))","v":""},{"$f":"IF(INDEX(i_FullYearReportDefs!Y:Y,MATCH($B86,i_FullYearReportDefs!$B:$B,0)+i_Settings!$C$9-1)=\"\",\"\",INDEX(i_FullYearReportDefs!Y:Y,MATCH($B86,i_FullYearReportDefs!$B:$B,0)+i_Settings!$C$9-1))","v":""},{"$f":"IF(INDEX(i_FullYearReportDefs!Z:Z,MATCH($B86,i_FullYearReportDefs!$B:$B,0)+i_Settings!$C$9-1)=\"\",\"\",INDEX(i_FullYearReportDefs!Z:Z,MATCH($B86,i_FullYearReportDefs!$B:$B,0)+i_Settings!$C$9-1))","v":""}]
[null,"FullFlagged student intervention report","Student ID","First Name","Last Name",{"$f":"IF(INDEX(i_FullYearReportDefs!C:C,MATCH($B87,i_FullYearReportDefs!$B:$B,0)+i_Settings!$C$9-1)=\"\",\"\",INDEX(i_FullYearReportDefs!C:C,MATCH($B87,i_FullYearReportDefs!$B:$B,0)+i_Settings!$C$9-1))","v":"Pre-HS indicator"},{"$f":"IF(INDEX(i_FullYearReportDefs!D:D,MATCH($B87,i_FullYearReportDefs!$B:$B,0)+i_Settings!$C$9-1)=\"\",\"\",INDEX(i_FullYearReportDefs!D:D,MATCH($B87,i_FullYearReportDefs!$B:$B,0)+i_Settings!$C$9-1))","v":"GP1_First 20 Day Attendance"},{"$f":"IF(INDEX(i_FullYearReportDefs!E:E,MATCH($B87,i_FullYearReportDefs!$B:$B,0)+i_Settings!$C$9-1)=\"\",\"\",INDEX(i_FullYearReportDefs!E:E,MATCH($B87,i_FullYearReportDefs!$B:$B,0)+i_Settings!$C$9-1))","v":"GP1_Attendance"},{"$f":"IF(INDEX(i_FullYearReportDefs!F:F,MATCH($B87,i_FullYearReportDefs!$B:$B,0)+i_Settings!$C$9-1)=\"\",\"\",INDEX(i_FullYearReportDefs!F:F,MATCH($B87,i_FullYearReportDefs!$B:$B,0)+i_Settings!$C$9-1))","v":"GP1_EngCourseFail"},{"$f":"IF(INDEX(i_FullYearReportDefs!G:G,MATCH($B87,i_FullYearReportDefs!$B:$B,0)+i_Settings!$C$9-1)=\"\",\"\",INDEX(i_FullYearReportDefs!G:G,MATCH($B87,i_FullYearReportDefs!$B:$B,0)+i_Settings!$C$9-1))","v":"GP1_MathCourseFail"},{"$f":"IF(INDEX(i_FullYearReportDefs!H:H,MATCH($B87,i_FullYearReportDefs!$B:$B,0)+i_Settings!$C$9-1)=\"\",\"\",INDEX(i_FullYearReportDefs!H:H,MATCH($B87,i_FullYearReportDefs!$B:$B,0)+i_Settings!$C$9-1))","v":"GP1_Behavior"},{"$f":"IF(INDEX(i_FullYearReportDefs!I:I,MATCH($B87,i_FullYearReportDefs!$B:$B,0)+i_Settings!$C$9-1)=\"\",\"\",INDEX(i_FullYearReportDefs!I:I,MATCH($B87,i_FullYearReportDefs!$B:$B,0)+i_Settings!$C$9-1))","v":"GP1 Interventions"},{"$f":"IF(INDEX(i_FullYearReportDefs!J:J,MATCH($B87,i_FullYearReportDefs!$B:$B,0)+i_Settings!$C$9-1)=\"\",\"\",INDEX(i_FullYearReportDefs!J:J,MATCH($B87,i_FullYearReportDefs!$B:$B,0)+i_Settings!$C$9-1))","v":"GP2_Attendance"},{"$f":"IF(INDEX(i_FullYearReportDefs!K:K,MATCH($B87,i_FullYearReportDefs!$B:$B,0)+i_Settings!$C$9-1)=\"\",\"\",INDEX(i_FullYearReportDefs!K:K,MATCH($B87,i_FullYearReportDefs!$B:$B,0)+i_Settings!$C$9-1))","v":"GP2_EngCourseFail"},{"$f":"IF(INDEX(i_FullYearReportDefs!L:L,MATCH($B87,i_FullYearReportDefs!$B:$B,0)+i_Settings!$C$9-1)=\"\",\"\",INDEX(i_FullYearReportDefs!L:L,MATCH($B87,i_FullYearReportDefs!$B:$B,0)+i_Settings!$C$9-1))","v":"GP2_MathCourseFail"},{"$f":"IF(INDEX(i_FullYearReportDefs!M:M,MATCH($B87,i_FullYearReportDefs!$B:$B,0)+i_Settings!$C$9-1)=\"\",\"\",INDEX(i_FullYearReportDefs!M:M,MATCH($B87,i_FullYearReportDefs!$B:$B,0)+i_Settings!$C$9-1))","v":"GP2_Behavior"},{"$f":"IF(INDEX(i_FullYearReportDefs!N:N,MATCH($B87,i_FullYearReportDefs!$B:$B,0)+i_Settings!$C$9-1)=\"\",\"\",INDEX(i_FullYearReportDefs!N:N,MATCH($B87,i_FullYearReportDefs!$B:$B,0)+i_Settings!$C$9-1))","v":"GP2 Interventions"},{"$f":"IF(INDEX(i_FullYearReportDefs!O:O,MATCH($B87,i_FullYearReportDefs!$B:$B,0)+i_Settings!$C$9-1)=\"\",\"\",INDEX(i_FullYearReportDefs!O:O,MATCH($B87,i_FullYearReportDefs!$B:$B,0)+i_Settings!$C$9-1))","v":"GP3_Attendance"},{"$f":"IF(INDEX(i_FullYearReportDefs!P:P,MATCH($B87,i_FullYearReportDefs!$B:$B,0)+i_Settings!$C$9-1)=\"\",\"\",INDEX(i_FullYearReportDefs!P:P,MATCH($B87,i_FullYearReportDefs!$B:$B,0)+i_Settings!$C$9-1))","v":"GP3_EngCourseFail"},{"$f":"IF(INDEX(i_FullYearReportDefs!Q:Q,MATCH($B87,i_FullYearReportDefs!$B:$B,0)+i_Settings!$C$9-1)=\"\",\"\",INDEX(i_FullYearReportDefs!Q:Q,MATCH($B87,i_FullYearReportDefs!$B:$B,0)+i_Settings!$C$9-1))","v":"GP3_MathCourseFail"},{"$f":"IF(INDEX(i_FullYearReportDefs!R:R,MATCH($B87,i_FullYearReportDefs!$B:$B,0)+i_Settings!$C$9-1)=\"\",\"\",INDEX(i_FullYearReportDefs!R:R,MATCH($B87,i_FullYearReportDefs!$B:$B,0)+i_Settings!$C$9-1))","v":"GP3_Behavior"},{"$f":"IF(INDEX(i_FullYearReportDefs!S:S,MATCH($B87,i_FullYearReportDefs!$B:$B,0)+i_Settings!$C$9-1)=\"\",\"\",INDEX(i_FullYearReportDefs!S:S,MATCH($B87,i_FullYearReportDefs!$B:$B,0)+i_Settings!$C$9-1))","v":"GP3 Interventions"},{"$f":"IF(INDEX(i_FullYearReportDefs!T:T,MATCH($B87,i_FullYearReportDefs!$B:$B,0)+i_Settings!$C$9-1)=\"\",\"\",INDEX(i_FullYearReportDefs!T:T,MATCH($B87,i_FullYearReportDefs!$B:$B,0)+i_Settings!$C$9-1))","v":"GP4_Attendance"},{"$f":"IF(INDEX(i_FullYearReportDefs!U:U,MATCH($B87,i_FullYearReportDefs!$B:$B,0)+i_Settings!$C$9-1)=\"\",\"\",INDEX(i_FullYearReportDefs!U:U,MATCH($B87,i_FullYearReportDefs!$B:$B,0)+i_Settings!$C$9-1))","v":"GP4_EngCourseFail"},{"$f":"IF(INDEX(i_FullYearReportDefs!V:V,MATCH($B87,i_FullYearReportDefs!$B:$B,0)+i_Settings!$C$9-1)=\"\",\"\",INDEX(i_FullYearReportDefs!V:V,MATCH($B87,i_FullYearReportDefs!$B:$B,0)+i_Settings!$C$9-1))","v":"GP4_MathCourseFail"},{"$f":"IF(INDEX(i_FullYearReportDefs!W:W,MATCH($B87,i_FullYearReportDefs!$B:$B,0)+i_Settings!$C$9-1)=\"\",\"\",INDEX(i_FullYearReportDefs!W:W,MATCH($B87,i_FullYearReportDefs!$B:$B,0)+i_Settings!$C$9-1))","v":"GP4_Behavior"},{"$f":"IF(INDEX(i_FullYearReportDefs!X:X,MATCH($B87,i_FullYearReportDefs!$B:$B,0)+i_Settings!$C$9-1)=\"\",\"\",INDEX(i_FullYearReportDefs!X:X,MATCH($B87,i_FullYearReportDefs!$B:$B,0)+i_Settings!$C$9-1))","v":"GP4 Interventions"},{"$f":"IF(INDEX(i_FullYearReportDefs!Y:Y,MATCH($B87,i_FullYearReportDefs!$B:$B,0)+i_Settings!$C$9-1)=\"\",\"\",INDEX(i_FullYearReportDefs!Y:Y,MATCH($B87,i_FullYearReportDefs!$B:$B,0)+i_Settings!$C$9-1))","v":"eoy_Attendance"},{"$f":"IF(INDEX(i_FullYearReportDefs!Z:Z,MATCH($B87,i_FullYearReportDefs!$B:$B,0)+i_Settings!$C$9-1)=\"\",\"\",INDEX(i_FullYearReportDefs!Z:Z,MATCH($B87,i_FullYearReportDefs!$B:$B,0)+i_Settings!$C$9-1))","v":"eoy_EngCourseFail"}]
[]
[]
[]
[null,"GP1Custom report 1","First Name","DOB"]
[null,"GP2Custom report 1"]
[null,"GP3Custom report 1"]
[null,"GP4Custom report 1"]
[null,"yrCustom report 1"]
[null,"FullCustom report 1"]
[null,"GP1Custom report 2"]
[null,"GP2Custom report 2"]
[null,"GP3Custom report 2"]
[null,"GP4Custom report 2"]
[null,"yrCustom report 2"]
[null,"FullCustom report 2"]
[null,"GP1Custom report 3"]
[null,"GP2Custom report 3"]
[null,"GP3Custom report 3"]
[null,"GP4Custom report 3"]
[null,"yrCustom report 3"]
[null,"FullCustom report 3"]
[null,"GP1Custom report 4"]
[null,"GP2Custom report 4"]
[null,"GP3Custom report 4"]
[null,"GP4Custom report 4"]
[null,"yrCustom report 4"]
[null,"FullCustom report 4"]
[null,"GP1Custom report 5"]
[null,"GP2Custom report 5"]
[null,"GP3Custom report 5"]
[null,"GP4Custom report 5"]
[null,"yrCustom report 5"]
[null,"FullCustom report 5"]
[]
[null,"Under-Credited Student ReportQ","Student ID","First Name","Last Name","GP1_Any att","GP1_Any acad","GP1_Behavior","GP1 Interventions","GP2_Attendance","GP2_Any acad","GP2_Behavior","GP2 Interventions","GP3_Attendance","GP3_Any acad","GP3_Behavior","GP3 Interventions","GP4_Attendance","GP4_Any acad","GP4_Behavior","GP4 Interventions","eoy_Attendance","eoy_Any acad","eoy_Behavior"]
[null,"Under-Credited Student ReportT","Student ID","First Name","Last Name","GP1_Any att","GP1_Any acad","GP1_Behavior","GP1 Interventions","GP2_Attendance","GP2_Any acad","GP2_Behavior","GP2 Interventions","GP3_Attendance","GP3_Any acad","GP3_Behavior","GP3 Interventions","eoy_Attendance","eoy_Any acad","eoy_Behavior"]
[null,"Under-Credited Student ReportS","Student ID","First Name","Last Name","GP1_Any att","GP1_Any acad","GP1_Behavior","GP1 Interventions","GP2_Attendance","GP2_Any acad","GP2_Behavior","GP2 Interventions","eoy_Attendance","eoy_Any acad","eoy_Behavior"]

{"sheet":"i_PresetFilters","index":19,"n_rows":1063,"n_cols":9,"rows_kept":1063,"cut":false,"hidden":true,"merged":[[1,1,2,6]]}
[]
[null,"Pre-set Filters"]
[]
[]
[]
[]
[]
[null,"Fields/report name","Filter 1","Filter 2","Filter 3","Filter 4","Filter 5",null,{"$f":"MATCH(ReportLookup,B:B,0)","v":{"$error":"#N/A"}}]
["Incoming Indicator of Risk Report","Incoming Indicator of Risk Report"]
["Pre-HS indicator",{"$f":"IF(A10=\"\",\"[Select a field name]\",INDEX(FieldNames!$E:$E,MATCH(A10,FieldNames!$A:$A,0)))","v":"Incoming Risk Indicator"},{"$f":"\"=1\"","v":"=1"}]
["Cohort",{"$f":"IF(A11=\"\",\"[Select a field name]\",INDEX(FieldNames!$E:$E,MATCH(A11,FieldNames!$A:$A,0)))","v":"Cohort"},{"$f":"\"=\"&IF(StudentRptCohort=\"All\",\"*\",StudentRptCohort)","v":"=*"}]
[null,{"$f":"IF(A12=\"\",\"[Select a field name]\",INDEX(FieldNames!$E:$E,MATCH(A12,FieldNames!$A:$A,0)))","v":"[Select a field name]"}]
[null,{"$f":"IF(A13=\"\",\"[Select a field name]\",INDEX(FieldNames!$E:$E,MATCH(A13,FieldNames!$A:$A,0)))","v":"[Select a field name]"}]
[null,{"$f":"IF(A14=\"\",\"[Select a field name]\",INDEX(FieldNames!$E:$E,MATCH(A14,FieldNames!$A:$A,0)))","v":"[Select a field name]"}]
[null,{"$f":"IF(A15=\"\",\"[Select a field name]\",INDEX(FieldNames!$E:$E,MATCH(A15,FieldNames!$A:$A,0)))","v":"[Select a field name]"}]
[null,{"$f":"IF(A16=\"\",\"[Select a field name]\",INDEX(FieldNames!$E:$E,MATCH(A16,FieldNames!$A:$A,0)))","v":"[Select a field name]"}]
[null,{"$f":"IF(A17=\"\",\"[Select a field name]\",INDEX(FieldNames!$E:$E,MATCH(A17,FieldNames!$A:$A,0)))","v":"[Select a field name]"}]
[null,{"$f":"IF(A18=\"\",\"[Select a field name]\",INDEX(FieldNames!$E:$E,MATCH(A18,FieldNames!$A:$A,0)))","v":"[Select a field name]"}]
[null,{"$f":"IF(A19=\"\",\"[Select a field name]\",INDEX(FieldNames!$E:$E,MATCH(A19,FieldNames!$A:$A,0)))","v":"[Select a field name]"}]
[]
["GP1Flagged student report","GP1Flagged student report"]
["GP1_Any Flag",{"$f":"IF(A22=\"\",\"[Select a field name]\",INDEX(FieldNames!$E:$E,MATCH(A22,FieldNames!$A:$A,0)))","v":"Quarter 1 Any Flag"},{"$f":"\"=1\"","v":"=1"}]
["Cohort",{"$f":"IF(A23=\"\",\"[Select a field name]\",INDEX(FieldNames!$E:$E,MATCH(A23,FieldNames!$A:$A,0)))","v":"Cohort"},{"$f":"\"=\"&IF(StudentRptCohort=\"All\",\"*\",StudentRptCohort)","v":"=*"}]
[null,{"$f":"IF(A24=\"\",\"[Select a field name]\",INDEX(FieldNames!$E:$E,MATCH(A24,FieldNames!$A:$A,0)))","v":"[Select a field name]"}]
[null,{"$f":"IF(A25=\"\",\"[Select a field name]\",INDEX(FieldNames!$E:$E,MATCH(A25,FieldNames!$A:$A,0)))","v":"[Select a field name]"}]
[null,{"$f":"IF(A26=\"\",\"[Select a field name]\",INDEX(FieldNames!$E:$E,MATCH(A26,FieldNames!$A:$A,0)))","v":"[Select a field name]"}]
[null,{"$f":"IF(A27=\"\",\"[Select a field name]\",INDEX(FieldNames!$E:$E,MATCH(A27,FieldNames!$A:$A,0)))","v":"[Select a field name]"}]
[null,{"$f":"IF(A28=\"\",\"[Select a field name]\",INDEX(FieldNames!$E:$E,MATCH(A28,FieldNames!$A:$A,0)))","v":"[Select a field name]"}]
[null,{"$f":"IF(A29=\"\",\"[Select a field name]\",INDEX(FieldNames!$E:$E,MATCH(A29,FieldNames!$A:$A,0)))","v":"[Select a field name]"}]
[null,{"$f":"IF(A30=\"\",\"[Select a field name]\",INDEX(FieldNames!$E:$E,MATCH(A30,FieldNames!$A:$A,0)))","v":"[Select a field name]"}]
[null,{"$f":"IF(A31=\"\",\"[Select a field name]\",INDEX(FieldNames!$E:$E,MATCH(A31,FieldNames!$A:$A,0)))","v":"[Select a field name]"}]
[null,""]
["GP2Flagged student report","GP2Flagged student report"]
["GP2_Any Flag",{"$f":"IF(A34=\"\",\"[Select a field name]\",INDEX(FieldNames!$E:$E,MATCH(A34,FieldNames!$A:$A,0)))","v":"Quarter 2 Any Flag"},{"$f":"\"=1\"","v":"=1"}]
["Cohort",{"$f":"IF(A35=\"\",\"[Select a field name]\",INDEX(FieldNames!$E:$E,MATCH(A35,FieldNames!$A:$A,0)))","v":"Cohort"},{"$f":"\"=\"&IF(StudentRptCohort=\"All\",\"*\",StudentRptCohort)","v":"=*"}]
[null,{"$f":"IF(A36=\"\",\"[Select a field name]\",INDEX(FieldNames!$E:$E,MATCH(A36,FieldNames!$A:$A,0)))","v":"[Select a field name]"}]
[null,{"$f":"IF(A37=\"\",\"[Select a field name]\",INDEX(FieldNames!$E:$E,MATCH(A37,FieldNames!$A:$A,0)))","v":"[Select a field name]"}]
[null,{"$f":"IF(A38=\"\",\"[Select a field name]\",INDEX(FieldNames!$E:$E,MATCH(A38,FieldNames!$A:$A,0)))","v":"[Select a field name]"}]
[null,{"$f":"IF(A39=\"\",\"[Select a field name]\",INDEX(FieldNames!$E:$E,MATCH(A39,FieldNames!$A:$A,0)))","v":"[Select a field name]"}]
[null,{"$f":"IF(A40=\"\",\"[Select a field name]\",INDEX(FieldNames!$E:$E,MATCH(A40,FieldNames!$A:$A,0)))","v":"[Select a field name]"}]
[null,{"$f":"IF(A41=\"\",\"[Select a field name]\",INDEX(FieldNames!$E:$E,MATCH(A41,FieldNames!$A:$A,0)))","v":"[Select a field name]"}]
[null,{"$f":"IF(A42=\"\",\"[Select a field name]\",INDEX(FieldNames!$E:$E,MATCH(A42,FieldNames!$A:$A,0)))","v":"[Select a field name]"}]
[null,{"$f":"IF(A43=\"\",\"[Select a field name]\",INDEX(FieldNames!$E:$E,MATCH(A43,FieldNames!$A:$A,0)))","v":"[Select a field name]"}]
[null,""]
["GP3Flagged student report","GP3Flagged student report"]
["GP3_Any Flag",{"$f":"IF(A46=\"\",\"[Select a field name]\",INDEX(FieldNames!$E:$E,MATCH(A46,FieldNames!$A:$A,0)))","v":"Quarter 3 Any Flag"},{"$f":"\"=1\"","v":"=1"}]
["Cohort",{"$f":"IF(A47=\"\",\"[Select a field name]\",INDEX(FieldNames!$E:$E,MATCH(A47,FieldNames!$A:$A,0)))","v":"Cohort"},{"$f":"\"=\"&IF(StudentRptCohort=\"All\",\"*\",StudentRptCohort)","v":"=*"}]
[null,{"$f":"IF(A48=\"\",\"[Select a field name]\",INDEX(FieldNames!$E:$E,MATCH(A48,FieldNames!$A:$A,0)))","v":"[Select a field name]"}]
[null,{"$f":"IF(A49=\"\",\"[Select a field name]\",INDEX(FieldNames!$E:$E,MATCH(A49,FieldNames!$A:$A,0)))","v":"[Select a field name]"}]
[null,{"$f":"IF(A50=\"\",\"[Select a field name]\",INDEX(FieldNames!$E:$E,MATCH(A50,FieldNames!$A:$A,0)))","v":"[Select a field name]"}]
[null,{"$f":"IF(A51=\"\",\"[Select a field name]\",INDEX(FieldNames!$E:$E,MATCH(A51,FieldNames!$A:$A,0)))","v":"[Select a field name]"}]
[null,{"$f":"IF(A52=\"\",\"[Select a field name]\",INDEX(FieldNames!$E:$E,MATCH(A52,FieldNames!$A:$A,0)))","v":"[Select a field name]"}]
[null,{"$f":"IF(A53=\"\",\"[Select a field name]\",INDEX(FieldNames!$E:$E,MATCH(A53,FieldNames!$A:$A,0)))","v":"[Select a field name]"}]
[null,{"$f":"IF(A54=\"\",\"[Select a field name]\",INDEX(FieldNames!$E:$E,MATCH(A54,FieldNames!$A:$A,0)))","v":"[Select a field name]"}]
[null,{"$f":"IF(A55=\"\",\"[Select a field name]\",INDEX(FieldNames!$E:$E,MATCH(A55,FieldNames!$A:$A,0)))","v":"[Select a field name]"}]
[null,""]
["GP4Flagged student report","GP4Flagged student report"]
["GP4_Any Flag",{"$f":"IF(A58=\"\",\"[Select a field name]\",INDEX(FieldNames!$E:$E,MATCH(A58,FieldNames!$A:$A,0)))","v":"Quarter 4 Any Flag"},{"$f":"\"=1\"","v":"=1"}]
["Cohort",{"$f":"IF(A59=\"\",\"[Select a field name]\",INDEX(FieldNames!$E:$E,MATCH(A59,FieldNames!$A:$A,0)))","v":"Cohort"},{"$f":"\"=\"&IF(StudentRptCohort=\"All\",\"*\",StudentRptCohort)","v":"=*"}]
[null,{"$f":"IF(A60=\"\",\"[Select a field name]\",INDEX(FieldNames!$E:$E,MATCH(A60,FieldNames!$A:$A,0)))","v":"[Select a field name]"}]
[null,{"$f":"IF(A61=\"\",\"[Select a field name]\",INDEX(FieldNames!$E:$E,MATCH(A61,FieldNames!$A:$A,0)))","v":"[Select a field name]"}]
[null,{"$f":"IF(A62=\"\",\"[Select a field name]\",INDEX(FieldNames!$E:$E,MATCH(A62,FieldNames!$A:$A,0)))","v":"[Select a field name]"}]
[null,{"$f":"IF(A63=\"\",\"[Select a field name]\",INDEX(FieldNames!$E:$E,MATCH(A63,FieldNames!$A:$A,0)))","v":"[Select a field name]"}]
[null,{"$f":"IF(A64=\"\",\"[Select a field name]\",INDEX(FieldNames!$E:$E,MATCH(A64,FieldNames!$A:$A,0)))","v":"[Select a field name]"}]
[null,{"$f":"IF(A65=\"\",\"[Select a field name]\",INDEX(FieldNames!$E:$E,MATCH(A65,FieldNames!$A:$A,0)))","v":"[Select a field name]"}]
[null,{"$f":"IF(A66=\"\",\"[Select a field name]\",INDEX(FieldNames!$E:$E,MATCH(A66,FieldNames!$A:$A,0)))","v":"[Select a field name]"}]
[null,{"$f":"IF(A67=\"\",\"[Select a field name]\",INDEX(FieldNames!$E:$E,MATCH(A67,FieldNames!$A:$A,0)))","v":"[Select a field name]"}]
[null,""]
["yrFlagged student report","yrFlagged student report"]
["eoy_Any flag",{"$f":"IF(A70=\"\",\"[Select a field name]\",INDEX(FieldNames!$E:$E,MATCH(A70,FieldNames!$A:$A,0)))","v":"End of Year Any Flag"},{"$f":"\"=1\"","v":"=1"}]
["Cohort",{"$f":"IF(A71=\"\",\"[Select a field name]\",INDEX(FieldNames!$E:$E,MATCH(A71,FieldNames!$A:$A,0)))","v":"Cohort"},{"$f":"\"=\"&IF(StudentRptCohort=\"All\",\"*\",StudentRptCohort)","v":"=*"}]
[null,{"$f":"IF(A72=\"\",\"[Select a field name]\",INDEX(FieldNames!$E:$E,MATCH(A72,FieldNames!$A:$A,0)))","v":"[Select a field name]"}]
[null,{"$f":"IF(A73=\"\",\"[Select a field name]\",INDEX(FieldNames!$E:$E,MATCH(A73,FieldNames!$A:$A,0)))","v":"[Select a field name]"}]
[null,{"$f":"IF(A74=\"\",\"[Select a field name]\",INDEX(FieldNames!$E:$E,MATCH(A74,FieldNames!$A:$A,0)))","v":"[Select a field name]"}]
[null,{"$f":"IF(A75=\"\",\"[Select a field name]\",INDEX(FieldNames!$E:$E,MATCH(A75,FieldNames!$A:$A,0)))","v":"[Select a field name]"}]
[null,{"$f":"IF(A76=\"\",\"[Select a field name]\",INDEX(FieldNames!$E:$E,MATCH(A76,FieldNames!$A:$A,0)))","v":"[Select a field name]"}]
[null,{"$f":"IF(A77=\"\",\"[Select a field name]\",INDEX(FieldNames!$E:$E,MATCH(A77,FieldNames!$A:$A,0)))","v":"[Select a field name]"}]
[null,{"$f":"IF(A78=\"\",\"[Select a field name]\",INDEX(FieldNames!$E:$E,MATCH(A78,FieldNames!$A:$A,0)))","v":"[Select a field name]"}]
[null,{"$f":"IF(A79=\"\",\"[Select a field name]\",INDEX(FieldNames!$E:$E,MATCH(A79,FieldNames!$A:$A,0)))","v":"[Select a field name]"}]
[null,""]
["FullFlagged student report","FullFlagged student report"]
["Any flag",{"$f":"IF(A82=\"\",\"[Select a field name]\",INDEX(FieldNames!$E:$E,MATCH(A82,FieldNames!$A:$A,0)))","v":"Any Flag"},{"$f":"\"=1\"","v":"=1"}]
["Pre-HS indicator",{"$f":"IF(A83=\"\",\"[Select a field name]\",INDEX(FieldNames!$E:$E,MATCH(A83,FieldNames!$A:$A,0)))","v":"Incoming Risk Indicator"},null,{"$f":"\"=1\"","v":"=1"}]
["Cohort",{"$f":"IF(A84=\"\",\"[Select a field name]\",INDEX(FieldNames!$E:$E,MATCH(A84,FieldNames!$A:$A,0)))","v":"Cohort"},{"$f":"\"=\"&IF(StudentRptCohort=\"All\",\"*\",StudentRptCohort)","v":"=*"},{"$f":"\"=\"&IF(StudentRptCohort=\"All\",\"*\",StudentRptCohort)","v":"=*"}]
[null,{"$f":"IF(A85=\"\",\"[Select a field name]\",INDEX(FieldNames!$E:$E,MATCH(A85,FieldNames!$A:$A,0)))","v":"[Select a field name]"}]
[null,{"$f":"IF(A86=\"\",\"[Select a field name]\",INDEX(FieldNames!$E:$E,MATCH(A86,FieldNames!$A:$A,0)))","v":"[Select a field name]"}]
[null,{"$f":"IF(A87=\"\",\"[Select a field name]\",INDEX(FieldNames!$E:$E,MATCH(A87,FieldNames!$A:$A,0)))","v":"[Select a field name]"}]
[null,{"$f":"IF(A88=\"\",\"[Select a field name]\",INDEX(FieldNames!$E:$E,MATCH(A88,FieldNames!$A:$A,0)))","v":"[Select a field name]"}]
[null,{"$f":"IF(A89=\"\",\"[Select a field name]\",INDEX(FieldNames!$E:$E,MATCH(A89,FieldNames!$A:$A,0)))","v":"[Select a field name]"}]
[null,{"$f":"IF(A90=\"\",\"[Select a field name]\",INDEX(FieldNames!$E:$E,MATCH(A90,FieldNames!$A:$A,0)))","v":"[Select a field name]"}]
[null,{"$f":"IF(A91=\"\",\"[Select a field name]\",INDEX(FieldNames!$E:$E,MATCH(A91,FieldNames!$A:$A,0)))","v":"[Select a field name]"}]
[null,""]
["GP1Flagged student report: Attendance","GP1Flagged student report: Attendance"]
["GP1_First 20 Day Attendance",{"$f":"IF(A94=\"\",\"[Select a field name]\",INDEX(FieldNames!$E:$E,MATCH(A94,FieldNames!$A:$A,0)))","v":"Quarter 1 First 20 Day Attendance Flag"},{"$f":"\"=1\"","v":"=1"}]
["GP1_Attendance",{"$f":"IF(A95=\"\",\"[Select a field name]\",INDEX(FieldNames!$E:$E,MATCH(A95,FieldNames!$A:$A,0)))","v":"Quarter 1 Attendance Flag"},null,{"$f":"\"=1\"","v":"=1"}]
["Cohort",{"$f":"IF(A96=\"\",\"[Select a field name]\",INDEX(FieldNames!$E:$E,MATCH(A96,FieldNames!$A:$A,0)))","v":"Cohort"},{"$f":"\"=\"&IF(StudentRptCohort=\"All\",\"*\",StudentRptCohort)","v":"=*"},{"$f":"\"=\"&IF(StudentRptCohort=\"All\",\"*\",StudentRptCohort)","v":"=*"}]
[null,{"$f":"IF(A97=\"\",\"[Select a field name]\",INDEX(FieldNames!$E:$E,MATCH(A97,FieldNames!$A:$A,0)))","v":"[Select a field name]"}]
[null,{"$f":"IF(A98=\"\",\"[Select a field name]\",INDEX(FieldNames!$E:$E,MATCH(A98,FieldNames!$A:$A,0)))","v":"[Select a field name]"}]
[null,{"$f":"IF(A99=\"\",\"[Select a field name]\",INDEX(FieldNames!$E:$E,MATCH(A99,FieldNames!$A:$A,0)))","v":"[Select a field name]"}]
[null,{"$f":"IF(A100=\"\",\"[Select a field name]\",INDEX(FieldNames!$E:$E,MATCH(A100,FieldNames!$A:$A,0)))","v":"[Select a field name]"}]
[null,{"$f":"IF(A101=\"\",\"[Select a field name]\",INDEX(FieldNames!$E:$E,MATCH(A101,FieldNames!$A:$A,0)))","v":"[Select a field name]"}]
[null,{"$f":"IF(A102=\"\",\"[Select a field name]\",INDEX(FieldNames!$E:$E,MATCH(A102,FieldNames!$A:$A,0)))","v":"[Select a field name]"}]
[null,{"$f":"IF(A103=\"\",\"[Select a field name]\",INDEX(FieldNames!$E:$E,MATCH(A103,FieldNames!$A:$A,0)))","v":"[Select a field name]"}]
[null,""]
["GP2Flagged student report: Attendance","GP2Flagged student report: Attendance"]
["GP2_Attendance",{"$f":"IF(A106=\"\",\"[Select a field name]\",INDEX(FieldNames!$E:$E,MATCH(A106,FieldNames!$A:$A,0)))","v":"Quarter 2 Attendance Flag"},{"$f":"\"=1\"","v":"=1"}]
["Cohort",{"$f":"IF(A107=\"\",\"[Select a field name]\",INDEX(FieldNames!$E:$E,MATCH(A107,FieldNames!$A:$A,0)))","v":"Cohort"},{"$f":"\"=\"&IF(StudentRptCohort=\"All\",\"*\",StudentRptCohort)","v":"=*"}]
[null,{"$f":"IF(A108=\"\",\"[Select a field name]\",INDEX(FieldNames!$E:$E,MATCH(A108,FieldNames!$A:$A,0)))","v":"[Select a field name]"}]
[null,{"$f":"IF(A109=\"\",\"[Select a field name]\",INDEX(FieldNames!$E:$E,MATCH(A109,FieldNames!$A:$A,0)))","v":"[Select a field name]"}]
[null,{"$f":"IF(A110=\"\",\"[Select a field name]\",INDEX(FieldNames!$E:$E,MATCH(A110,FieldNames!$A:$A,0)))","v":"[Select a field name]"}]
[null,{"$f":"IF(A111=\"\",\"[Select a field name]\",INDEX(FieldNames!$E:$E,MATCH(A111,FieldNames!$A:$A,0)))","v":"[Select a field name]"}]
[null,{"$f":"IF(A112=\"\",\"[Select a field name]\",INDEX(FieldNames!$E:$E,MATCH(A112,FieldNames!$A:$A,0)))","v":"[Select a field name]"}]
[null,{"$f":"IF(A113=\"\",\"[Select a field name]\",INDEX(FieldNames!$E:$E,MATCH(A113,FieldNames!$A:$A,0)))","v":"[Select a field name]"}]
[null,{"$f":"IF(A114=\"\",\"[Select a field name]\",INDEX(FieldNames!$E:$E,MATCH(A114,FieldNames!$A:$A,0)))","v":"[Select a field name]"}]
[null,{"$f":"IF(A115=\"\",\"[Select a field name]\",INDEX(FieldNames!$E:$E,MATCH(A115,FieldNames!$A:$A,0)))","v":"[Select a field name]"}]
[null,""]
["GP3Flagged student report: Attendance","GP3Flagged student report: Attendance"]
["GP3_Attendance",{"$f":"IF(A118=\"\",\"[Select a field name]\",INDEX(FieldNames!$E:$E,MATCH(A118,FieldNames!$A:$A,0)))","v":"Quarter 3 Attendance Flag"},{"$f":"\"=1\"","v":"=1"}]
["Cohort",{"$f":"IF(A119=\"\",\"[Select a field name]\",INDEX(FieldNames!$E:$E,MATCH(A119,FieldNames!$A:$A,0)))","v":"Cohort"},{"$f":"\"=\"&IF(StudentRptCohort=\"All\",\"*\",StudentRptCohort)","v":"=*"}]
[null,{"$f":"IF(A120=\"\",\"[Select a field name]\",INDEX(FieldNames!$E:$E,MATCH(A120,FieldNames!$A:$A,0)))","v":"[Select a field name]"}]
[null,{"$f":"IF(A121=\"\",\"[Select a field name]\",INDEX(FieldNames!$E:$E,MATCH(A121,FieldNames!$A:$A,0)))","v":"[Select a field name]"}]
[null,{"$f":"IF(A122=\"\",\"[Select a field name]\",INDEX(FieldNames!$E:$E,MATCH(A122,FieldNames!$A:$A,0)))","v":"[Select a field name]"}]
[null,{"$f":"IF(A123=\"\",\"[Select a field name]\",INDEX(FieldNames!$E:$E,MATCH(A123,FieldNames!$A:$A,0)))","v":"[Select a field name]"}]
[null,{"$f":"IF(A124=\"\",\"[Select a field name]\",INDEX(FieldNames!$E:$E,MATCH(A124,FieldNames!$A:$A,0)))","v":"[Select a field name]"}]
[null,{"$f":"IF(A125=\"\",\"[Select a field name]\",INDEX(FieldNames!$E:$E,MATCH(A125,FieldNames!$A:$A,0)))","v":"[Select a field name]"}]
[null,{"$f":"IF(A126=\"\",\"[Select a field name]\",INDEX(FieldNames!$E:$E,MATCH(A126,FieldNames!$A:$A,0)))","v":"[Select a field name]"}]
[null,{"$f":"IF(A127=\"\",\"[Select a field name]\",INDEX(FieldNames!$E:$E,MATCH(A127,FieldNames!$A:$A,0)))","v":"[Select a field name]"}]
[null,""]
["GP4Flagged student report: Attendance","GP4Flagged student report: Attendance"]
["GP4_Attendance",{"$f":"IF(A130=\"\",\"[Select a field name]\",INDEX(FieldNames!$E:$E,MATCH(A130,FieldNames!$A:$A,0)))","v":"Quarter 4 Attendance Flag"},{"$f":"\"=1\"","v":"=1"}]
["Cohort",{"$f":"IF(A131=\"\",\"[Select a field name]\",INDEX(FieldNames!$E:$E,MATCH(A131,FieldNames!$A:$A,0)))","v":"Cohort"},{"$f":"\"=\"&IF(StudentRptCohort=\"All\",\"*\",StudentRptCohort)","v":"=*"}]
[null,{"$f":"IF(A132=\"\",\"[Select a field name]\",INDEX(FieldNames!$E:$E,MATCH(A132,FieldNames!$A:$A,0)))","v":"[Select a field name]"}]
[null,{"$f":"IF(A133=\"\",\"[Select a field name]\",INDEX(FieldNames!$E:$E,MATCH(A133,FieldNames!$A:$A,0)))","v":"[Select a field name]"}]
[null,{"$f":"IF(A134=\"\",\"[Select a field name]\",INDEX(FieldNames!$E:$E,MATCH(A134,FieldNames!$A:$A,0)))","v":"[Select a field name]"}]
[null,{"$f":"IF(A135=\"\",\"[Select a field name]\",INDEX(FieldNames!$E:$E,MATCH(A135,FieldNames!$A:$A,0)))","v":"[Select a field name]"}]
[null,{"$f":"IF(A136=\"\",\"[Select a field name]\",INDEX(FieldNames!$E:$E,MATCH(A136,FieldNames!$A:$A,0)))","v":"[Select a field name]"}]
[null,{"$f":"IF(A137=\"\",\"[Select a field name]\",INDEX(FieldNames!$E:$E,MATCH(A137,FieldNames!$A:$A,0)))","v":"[Select a field name]"}]
[null,{"$f":"IF(A138=\"\",\"[Select a field name]\",INDEX(FieldNames!$E:$E,MATCH(A138,FieldNames!$A:$A,0)))","v":"[Select a field name]"}]
[null,{"$f":"IF(A139=\"\",\"[Select a field name]\",INDEX(FieldNames!$E:$E,MATCH(A139,FieldNames!$A:$A,0)))","v":"[Select a field name]"}]
[null,""]
["yrFlagged student report: Attendance","yrFlagged student report: Attendance"]
["eoy_attendance",{"$f":"IF(A142=\"\",\"[Select a field name]\",INDEX(FieldNames!$E:$E,MATCH(A142,FieldNames!$A:$A,0)))","v":"End of Year Attendance Flag"},{"$f":"\"=1\"","v":"=1"}]
["Cohort",{"$f":"IF(A143=\"\",\"[Select a field name]\",INDEX(FieldNames!$E:$E,MATCH(A143,FieldNames!$A:$A,0)))","v":"Cohort"},{"$f":"\"=\"&IF(StudentRptCohort=\"All\",\"*\",StudentRptCohort)","v":"=*"}]
[null,{"$f":"IF(A144=\"\",\"[Select a field name]\",INDEX(FieldNames!$E:$E,MATCH(A144,FieldNames!$A:$A,0)))","v":"[Select a field name]"}]
[null,{"$f":"IF(A145=\"\",\"[Select a field name]\",INDEX(FieldNames!$E:$E,MATCH(A145,FieldNames!$A:$A,0)))","v":"[Select a field name]"}]
[null,{"$f":"IF(A146=\"\",\"[Select a field name]\",INDEX(FieldNames!$E:$E,MATCH(A146,FieldNames!$A:$A,0)))","v":"[Select a field name]"}]
[null,{"$f":"IF(A147=\"\",\"[Select a field name]\",INDEX(FieldNames!$E:$E,MATCH(A147,FieldNames!$A:$A,0)))","v":"[Select a field name]"}]
[null,{"$f":"IF(A148=\"\",\"[Select a field name]\",INDEX(FieldNames!$E:$E,MATCH(A148,FieldNames!$A:$A,0)))","v":"[Select a field name]"}]
[null,{"$f":"IF(A149=\"\",\"[Select a field name]\",INDEX(FieldNames!$E:$E,MATCH(A149,FieldNames!$A:$A,0)))","v":"[Select a field name]"}]
[null,{"$f":"IF(A150=\"\",\"[Select a field name]\",INDEX(FieldNames!$E:$E,MATCH(A150,FieldNames!$A:$A,0)))","v":"[Select a field name]"}]
[null,{"$f":"IF(A151=\"\",\"[Select a field name]\",INDEX(FieldNames!$E:$E,MATCH(A151,FieldNames!$A:$A,0)))","v":"[Select a field name]"}]
[null,""]
["FullFlagged student report: Attendance","FullFlagged student report: Attendance"]
["Any att",{"$f":"IF(A154=\"\",\"[Select a field name]\",INDEX(FieldNames!$E:$E,MATCH(A154,FieldNames!$A:$A,0)))","v":"Any Attendance Flag"},{"$f":"\"=1\"","v":"=1"}]
["Cohort",{"$f":"IF(A155=\"\",\"[Select a field name]\",INDEX(FieldNames!$E:$E,MATCH(A155,FieldNames!$A:$A,0)))","v":"Cohort"},{"$f":"\"=\"&IF(StudentRptCohort=\"All\",\"*\",StudentRptCohort)","v":"=*"}]
[null,{"$f":"IF(A156=\"\",\"[Select a field name]\",INDEX(FieldNames!$E:$E,MATCH(A156,FieldNames!$A:$A,0)))","v":"[Select a field name]"}]
[null,{"$f":"IF(A157=\"\",\"[Select a field name]\",INDEX(FieldNames!$E:$E,MATCH(A157,FieldNames!$A:$A,0)))","v":"[Select a field name]"}]
[null,{"$f":"IF(A158=\"\",\"[Select a field name]\",INDEX(FieldNames!$E:$E,MATCH(A158,FieldNames!$A:$A,0)))","v":"[Select a field name]"}]
[null,{"$f":"IF(A159=\"\",\"[Select a field name]\",INDEX(FieldNames!$E:$E,MATCH(A159,FieldNames!$A:$A,0)))","v":"[Select a field name]"}]
[null,{"$f":"IF(A160=\"\",\"[Select a field name]\",INDEX(FieldNames!$E:$E,MATCH(A160,FieldNames!$A:$A,0)))","v":"[Select a field name]"}]
[null,{"$f":"IF(A161=\"\",\"[Select a field name]\",INDEX(FieldNames!$E:$E,MATCH(A161,FieldNames!$A:$A,0)))","v":"[Select a field name]"}]
[null,{"$f":"IF(A162=\"\",\"[Select a field name]\",INDEX(FieldNames!$E:$E,MATCH(A162,FieldNames!$A:$A,0)))","v":"[Select a field name]"}]
[null,{"$f":"IF(A163=\"\",\"[Select a field name]\",INDEX(FieldNames!$E:$E,MATCH(A163,FieldNames!$A:$A,0)))","v":"[Select a field name]"}]
[null,""]
["GP1Flagged student report: Academics","GP1Flagged student report: Academics"]
["GP1_EngCourseFail",{"$f":"IF(A166=\"\",\"[Select a field name]\",INDEX(FieldNames!$E:$E,MATCH(A166,FieldNames!$A:$A,0)))","v":"Quarter 1 English Course Fail Flag"},{"$f":"\"=1\"","v":"=1"}]
["GP1_MathCourseFail",{"$f":"IF(A167=\"\",\"[Select a field name]\",INDEX(FieldNames!$E:$E,MATCH(A167,FieldNames!$A:$A,0)))","v":"Quarter 1 Math Course Fail Flag"},null,{"$f":"\"=1\"","v":"=1"}]
["Cohort",{"$f":"IF(A168=\"\",\"[Select a field name]\",INDEX(FieldNames!$E:$E,MATCH(A168,FieldNames!$A:$A,0)))","v":"Cohort"},{"$f":"\"=\"&IF(StudentRptCohort=\"All\",\"*\",StudentRptCohort)","v":"=*"},{"$f":"\"=\"&IF(StudentRptCohort=\"All\",\"*\",StudentRptCohort)","v":"=*"}]
[null,{"$f":"IF(A169=\"\",\"[Select a field name]\",INDEX(FieldNames!$E:$E,MATCH(A169,FieldNames!$A:$A,0)))","v":"[Select a field name]"}]
[null,{"$f":"IF(A170=\"\",\"[Select a field name]\",INDEX(FieldNames!$E:$E,MATCH(A170,FieldNames!$A:$A,0)))","v":"[Select a field name]"}]
[null,{"$f":"IF(A171=\"\",\"[Select a field name]\",INDEX(FieldNames!$E:$E,MATCH(A171,FieldNames!$A:$A,0)))","v":"[Select a field name]"}]
[null,{"$f":"IF(A172=\"\",\"[Select a field name]\",INDEX(FieldNames!$E:$E,MATCH(A172,FieldNames!$A:$A,0)))","v":"[Select a field name]"}]
[null,{"$f":"IF(A173=\"\",\"[Select a field name]\",INDEX(FieldNames!$E:$E,MATCH(A173,FieldNames!$A:$A,0)))","v":"[Select a field name]"}]
[null,{"$f":"IF(A174=\"\",\"[Select a field name]\",INDEX(FieldNames!$E:$E,MATCH(A174,FieldNames!$A:$A,0)))","v":"[Select a field name]"}]
[null,{"$f":"IF(A175=\"\",\"[Select a field name]\",INDEX(FieldNames!$E:$E,MATCH(A175,FieldNames!$A:$A,0)))","v":"[Select a field name]"}]
[null,""]
["GP2Flagged student report: Academics","GP2Flagged student report: Academics"]
["GP2_EngCourseFail",{"$f":"IF(A178=\"\",\"[Select a field name]\",INDEX(FieldNames!$E:$E,MATCH(A178,FieldNames!$A:$A,0)))","v":"Quarter 2 English Course Fail Flag"},{"$f":"\"=1\"","v":"=1"}]
["GP2_MathCourseFail",{"$f":"IF(A179=\"\",\"[Select a field name]\",INDEX(FieldNames!$E:$E,MATCH(A179,FieldNames!$A:$A,0)))","v":"Quarter 2 Math Course Fail Flag"},null,{"$f":"\"=1\"","v":"=1"}]
["Cohort",{"$f":"IF(A180=\"\",\"[Select a field name]\",INDEX(FieldNames!$E:$E,MATCH(A180,FieldNames!$A:$A,0)))","v":"Cohort"},{"$f":"\"=\"&IF(StudentRptCohort=\"All\",\"*\",StudentRptCohort)","v":"=*"},{"$f":"\"=\"&IF(StudentRptCohort=\"All\",\"*\",StudentRptCohort)","v":"=*"}]
[null,{"$f":"IF(A181=\"\",\"[Select a field name]\",INDEX(FieldNames!$E:$E,MATCH(A181,FieldNames!$A:$A,0)))","v":"[Select a field name]"}]
[null,{"$f":"IF(A182=\"\",\"[Select a field name]\",INDEX(FieldNames!$E:$E,MATCH(A182,FieldNames!$A:$A,0)))","v":"[Select a field name]"}]
[null,{"$f":"IF(A183=\"\",\"[Select a field name]\",INDEX(FieldNames!$E:$E,MATCH(A183,FieldNames!$A:$A,0)))","v":"[Select a field name]"}]
[null,{"$f":"IF(A184=\"\",\"[Select a field name]\",INDEX(FieldNames!$E:$E,MATCH(A184,FieldNames!$A:$A,0)))","v":"[Select a field name]"}]
[null,{"$f":"IF(A185=\"\",\"[Select a field name]\",INDEX(FieldNames!$E:$E,MATCH(A185,FieldNames!$A:$A,0)))","v":"[Select a field name]"}]
[null,{"$f":"IF(A186=\"\",\"[Select a field name]\",INDEX(FieldNames!$E:$E,MATCH(A186,FieldNames!$A:$A,0)))","v":"[Select a field name]"}]
[null,{"$f":"IF(A187=\"\",\"[Select a field name]\",INDEX(FieldNames!$E:$E,MATCH(A187,FieldNames!$A:$A,0)))","v":"[Select a field name]"}]
[null,""]
["GP3Flagged student report: Academics","GP3Flagged student report: Academics"]
["GP3_EngCourseFail",{"$f":"IF(A190=\"\",\"[Select a field name]\",INDEX(FieldNames!$E:$E,MATCH(A190,FieldNames!$A:$A,0)))","v":"Quarter 3 English Course Fail Flag"},{"$f":"\"=1\"","v":"=1"}]
["GP3_MathCourseFail",{"$f":"IF(A191=\"\",\"[Select a field name]\",INDEX(FieldNames!$E:$E,MATCH(A191,FieldNames!$A:$A,0)))","v":"Quarter 3 Math Course Fail Flag"},null,{"$f":"\"=1\"","v":"=1"}]
["Cohort",{"$f":"IF(A192=\"\",\"[Select a field name]\",INDEX(FieldNames!$E:$E,MATCH(A192,FieldNames!$A:$A,0)))","v":"Cohort"},{"$f":"\"=\"&IF(StudentRptCohort=\"All\",\"*\",StudentRptCohort)","v":"=*"},{"$f":"\"=\"&IF(StudentRptCohort=\"All\",\"*\",StudentRptCohort)","v":"=*"}]
[null,{"$f":"IF(A193=\"\",\"[Select a field name]\",INDEX(FieldNames!$E:$E,MATCH(A193,FieldNames!$A:$A,0)))","v":"[Select a field name]"}]
[null,{"$f":"IF(A194=\"\",\"[Select a field name]\",INDEX(FieldNames!$E:$E,MATCH(A194,FieldNames!$A:$A,0)))","v":"[Select a field name]"}]
[null,{"$f":"IF(A195=\"\",\"[Select a field name]\",INDEX(FieldNames!$E:$E,MATCH(A195,FieldNames!$A:$A,0)))","v":"[Select a field name]"}]
[null,{"$f":"IF(A196=\"\",\"[Select a field name]\",INDEX(FieldNames!$E:$E,MATCH(A196,FieldNames!$A:$A,0)))","v":"[Select a field name]"}]
[null,{"$f":"IF(A197=\"\",\"[Select a field name]\",INDEX(FieldNames!$E:$E,MATCH(A197,FieldNames!$A:$A,0)))","v":"[Select a field name]"}]
[null,{"$f":"IF(A198=\"\",\"[Select a field name]\",INDEX(FieldNames!$E:$E,MATCH(A198,FieldNames!$A:$A,0)))","v":"[Select a field name]"}]
[null,{"$f":"IF(A199=\"\",\"[Select a field name]\",INDEX(FieldNames!$E:$E,MATCH(A199,FieldNames!$A:$A,0)))","v":"[Select a field name]"}]
[null,""]
["GP4Flagged student report: Academics","GP4Flagged student report: Academics"]
["GP4_EngCourseFail",{"$f":"IF(A202=\"\",\"[Select a field name]\",INDEX(FieldNames!$E:$E,MATCH(A202,FieldNames!$A:$A,0)))","v":"Quarter 4 English Course Fail Flag"},{"$f":"\"=1\"","v":"=1"}]
["GP4_MathCourseFail",{"$f":"IF(A203=\"\",\"[Select a field name]\",INDEX(FieldNames!$E:$E,MATCH(A203,FieldNames!$A:$A,0)))","v":"Quarter 4 Math Course Fail Flag"},null,{"$f":"\"=1\"","v":"=1"}]
["Cohort",{"$f":"IF(A204=\"\",\"[Select a field name]\",INDEX(FieldNames!$E:$E,MATCH(A204,FieldNames!$A:$A,0)))","v":"Cohort"},{"$f":"\"=\"&IF(StudentRptCohort=\"All\",\"*\",StudentRptCohort)","v":"=*"},{"$f":"\"=\"&IF(StudentRptCohort=\"All\",\"*\",StudentRptCohort)","v":"=*"}]
[null,{"$f":"IF(A205=\"\",\"[Select a field name]\",INDEX(FieldNames!$E:$E,MATCH(A205,FieldNames!$A:$A,0)))","v":"[Select a field name]"}]
[null,{"$f":"IF(A206=\"\",\"[Select a field name]\",INDEX(FieldNames!$E:$E,MATCH(A206,FieldNames!$A:$A,0)))","v":"[Select a field name]"}]
[null,{"$f":"IF(A207=\"\",\"[Select a field name]\",INDEX(FieldNames!$E:$E,MATCH(A207,FieldNames!$A:$A,0)))","v":"[Select a field name]"}]
[null,{"$f":"IF(A208=\"\",\"[Select a field name]\",INDEX(FieldNames!$E:$E,MATCH(A208,FieldNames!$A:$A,0)))","v":"[Select a field name]"}]
[null,{"$f":"IF(A209=\"\",\"[Select a field name]\",INDEX(FieldNames!$E:$E,MATCH(A209,FieldNames!$A:$A,0)))","v":"[Select a field name]"}]
[null,{"$f":"IF(A210=\"\",\"[Select a field name]\",INDEX(FieldNames!$E:$E,MATCH(A210,FieldNames!$A:$A,0)))","v":"[Select a field name]"}]
[null,{"$f":"IF(A211=\"\",\"[Select a field name]\",INDEX(FieldNames!$E:$E,MATCH(A211,FieldNames!$A:$A,0)))","v":"[Select a field name]"}]
[null,""]
["yrFlagged student report: Academics","yrFlagged student report: Academics"]
["eoy_EngCourseFail",{"$f":"IF(A214=\"\",\"[Select a field name]\",INDEX(FieldNames!$E:$E,MATCH(A214,FieldNames!$A:$A,0)))","v":"End of Year English Course Fail Flag"},{"$f":"\"=1\"","v":"=1"}]
["eoy_MathCourseFail",{"$f":"IF(A215=\"\",\"[Select a field name]\",INDEX(FieldNames!$E:$E,MATCH(A215,FieldNames!$A:$A,0)))","v":"End of Year Math Course Fail Flag"},null,{"$f":"\"=1\"","v":"=1"}]
["Cohort",{"$f":"IF(A216=\"\",\"[Select a field name]\",INDEX(FieldNames!$E:$E,MATCH(A216,FieldNames!$A:$A,0)))","v":"Cohort"},{"$f":"\"=\"&IF(StudentRptCohort=\"All\",\"*\",StudentRptCohort)","v":"=*"},{"$f":"\"=\"&IF(StudentRptCohort=\"All\",\"*\",StudentRptCohort)","v":"=*"}]
[null,{"$f":"IF(A217=\"\",\"[Select a field name]\",INDEX(FieldNames!$E:$E,MATCH(A217,FieldNames!$A:$A,0)))","v":"[Select a field name]"}]
[null,{"$f":"IF(A218=\"\",\"[Select a field name]\",INDEX(FieldNames!$E:$E,MATCH(A218,FieldNames!$A:$A,0)))","v":"[Select a field name]"}]
[null,{"$f":"IF(A219=\"\",\"[Select a field name]\",INDEX(FieldNames!$E:$E,MATCH(A219,FieldNames!$A:$A,0)))","v":"[Select a field name]"}]
[null,{"$f":"IF(A220=\"\",\"[Select a field name]\",INDEX(FieldNames!$E:$E,MATCH(A220,FieldNames!$A:$A,0)))","v":"[Select a field name]"}]
[null,{"$f":"IF(A221=\"\",\"[Select a field name]\",INDEX(FieldNames!$E:$E,MATCH(A221,FieldNames!$A:$A,0)))","v":"[Select a field name]"}]
[null,{"$f":"IF(A222=\"\",\"[Select a field name]\",INDEX(FieldNames!$E:$E,MATCH(A222,FieldNames!$A:$A,0)))","v":"[Select a field name]"}]
[null,{"$f":"IF(A223=\"\",\"[Select a field name]\",INDEX(FieldNames!$E:$E,MATCH(A223,FieldNames!$A:$A,0)))","v":"[Select a field name]"}]
[null,""]
["FullFlagged student report: Academics","FullFlagged student report: Academics"]
["Any acad",{"$f":"IF(A226=\"\",\"[Select a field name]\",INDEX(FieldNames!$E:$E,MATCH(A226,FieldNames!$A:$A,0)))","v":"Any Academic Flag"},{"$f":"\"=1\"","v":"=1"}]
["Cohort",{"$f":"IF(A227=\"\",\"[Select a field name]\",INDEX(FieldNames!$E:$E,MATCH(A227,FieldNames!$A:$A,0)))","v":"Cohort"},{"$f":"\"=\"&IF(StudentRptCohort=\"All\",\"*\",StudentRptCohort)","v":"=*"}]
[null,{"$f":"IF(A228=\"\",\"[Select a field name]\",INDEX(FieldNames!$E:$E,MATCH(A228,FieldNames!$A:$A,0)))","v":"[Select a field name]"}]
[null,{"$f":"IF(A229=\"\",\"[Select a field name]\",INDEX(FieldNames!$E:$E,MATCH(A229,FieldNames!$A:$A,0)))","v":"[Select a field name]"}]
[null,{"$f":"IF(A230=\"\",\"[Select a field name]\",INDEX(FieldNames!$E:$E,MATCH(A230,FieldNames!$A:$A,0)))","v":"[Select a field name]"}]
[null,{"$f":"IF(A231=\"\",\"[Select a field name]\",INDEX(FieldNames!$E:$E,MATCH(A231,FieldNames!$A:$A,0)))","v":"[Select a field name]"}]
[null,{"$f":"IF(A232=\"\",\"[Select a field name]\",INDEX(FieldNames!$E:$E,MATCH(A232,FieldNames!$A:$A,0)))","v":"[Select a field name]"}]
[null,{"$f":"IF(A233=\"\",\"[Select a field name]\",INDEX(FieldNames!$E:$E,MATCH(A233,FieldNames!$A:$A,0)))","v":"[Select a field name]"}]
[null,{"$f":"IF(A234=\"\",\"[Select a field name]\",INDEX(FieldNames!$E:$E,MATCH(A234,FieldNames!$A:$A,0)))","v":"[Select a field name]"}]
[null,{"$f":"IF(A235=\"\",\"[Select a field name]\",INDEX(FieldNames!$E:$E,MATCH(A235,FieldNames!$A:$A,0)))","v":"[Select a field name]"}]
[null,""]
["Off-track for graduation","Off-track for graduation"]
["eoy_Any flag",{"$f":"IF(A238=\"\",\"[Select a field name]\",INDEX(FieldNames!$E:$E,MATCH(A238,FieldNames!$A:$A,0)))","v":"End of Year Any Flag"},{"$f":"\"=1\"","v":"=1"}]
["Cohort",{"$f":"IF(A239=\"\",\"[Select a field name]\",INDEX(FieldNames!$E:$E,MATCH(A239,FieldNames!$A:$A,0)))","v":"Cohort"},{"$f":"\"=\"&IF(StudentRptCohort=\"All\",\"*\",StudentRptCohort)","v":"=*"}]
[null,{"$f":"IF(A240=\"\",\"[Select a field name]\",INDEX(FieldNames!$E:$E,MATCH(A240,FieldNames!$A:$A,0)))","v":"[Select a field name]"}]
[null,{"$f":"IF(A241=\"\",\"[Select a field name]\",INDEX(FieldNames!$E:$E,MATCH(A241,FieldNames!$A:$A,0)))","v":"[Select a field name]"}]
[null,{"$f":"IF(A242=\"\",\"[Select a field name]\",INDEX(FieldNames!$E:$E,MATCH(A242,FieldNames!$A:$A,0)))","v":"[Select a field name]"}]
[null,{"$f":"IF(A243=\"\",\"[Select a field name]\",INDEX(FieldNames!$E:$E,MATCH(A243,FieldNames!$A:$A,0)))","v":"[Select a field name]"}]
[null,{"$f":"IF(A244=\"\",\"[Select a field name]\",INDEX(FieldNames!$E:$E,MATCH(A244,FieldNames!$A:$A,0)))","v":"[Select a field name]"}]
[null,{"$f":"IF(A245=\"\",\"[Select a field name]\",INDEX(FieldNames!$E:$E,MATCH(A245,FieldNames!$A:$A,0)))","v":"[Select a field name]"}]
[null,{"$f":"IF(A246=\"\",\"[Select a field name]\",INDEX(FieldNames!$E:$E,MATCH(A246,FieldNames!$A:$A,0)))","v":"[Select a field name]"}]
[null,{"$f":"IF(A247=\"\",\"[Select a field name]\",INDEX(FieldNames!$E:$E,MATCH(A247,FieldNames!$A:$A,0)))","v":"[Select a field name]"}]
[null,""]
["GP1Flagged Student Report: Disabilities","GP1Flagged Student Report: Disabilities"]
["Disability flag",{"$f":"IF(A250=\"\",\"[Select a field name]\",INDEX(FieldNames!$E:$E,MATCH(A250,FieldNames!$A:$A,0)))","v":"Any Disability"},{"$f":"\"=1\"","v":"=1"}]
["GP1_Any Flag",{"$f":"IF(A251=\"\",\"[Select a field name]\",INDEX(FieldNames!$E:$E,MATCH(A251,FieldNames!$A:$A,0)))","v":"Quarter 1 Any Flag"},{"$f":"\"=1\"","v":"=1"}]
["Cohort",{"$f":"IF(A252=\"\",\"[Select a field name]\",INDEX(FieldNames!$E:$E,MATCH(A252,FieldNames!$A:$A,0)))","v":"Cohort"},{"$f":"\"=\"&IF(StudentRptCohort=\"All\",\"*\",StudentRptCohort)","v":"=*"}]
[null,{"$f":"IF(A253=\"\",\"[Select a field name]\",INDEX(FieldNames!$E:$E,MATCH(A253,FieldNames!$A:$A,0)))","v":"[Select a field name]"}]
[null,{"$f":"IF(A254=\"\",\"[Select a field name]\",INDEX(FieldNames!$E:$E,MATCH(A254,FieldNames!$A:$A,0)))","v":"[Select a field name]"}]
[null,{"$f":"IF(A255=\"\",\"[Select a field name]\",INDEX(FieldNames!$E:$E,MATCH(A255,FieldNames!$A:$A,0)))","v":"[Select a field name]"}]
[null,{"$f":"IF(A256=\"\",\"[Select a field name]\",INDEX(FieldNames!$E:$E,MATCH(A256,FieldNames!$A:$A,0)))","v":"[Select a field name]"}]
[null,{"$f":"IF(A257=\"\",\"[Select a field name]\",INDEX(FieldNames!$E:$E,MATCH(A257,FieldNames!$A:$A,0)))","v":"[Select a field name]"}]
[null,{"$f":"IF(A258=\"\",\"[Select a field name]\",INDEX(FieldNames!$E:$E,MATCH(A258,FieldNames!$A:$A,0)))","v":"[Select a field name]"}]
[null,{"$f":"IF(A259=\"\",\"[Select a field name]\",INDEX(FieldNames!$E:$E,MATCH(A259,FieldNames!$A:$A,0)))","v":"[Select a field name]"}]
[null,""]
["GP2Flagged Student Report: Disabilities","GP2Flagged Student Report: Disabilities"]
["Disability flag",{"$f":"IF(A262=\"\",\"[Select a field name]\",INDEX(FieldNames!$E:$E,MATCH(A262,FieldNames!$A:$A,0)))","v":"Any Disability"},{"$f":"\"=1\"","v":"=1"}]
["GP2_Any Flag",{"$f":"IF(A263=\"\",\"[Select a field name]\",INDEX(FieldNames!$E:$E,MATCH(A263,FieldNames!$A:$A,0)))","v":"Quarter 2 Any Flag"},{"$f":"\"=1\"","v":"=1"}]
["Cohort",{"$f":"IF(A264=\"\",\"[Select a field name]\",INDEX(FieldNames!$E:$E,MATCH(A264,FieldNames!$A:$A,0)))","v":"Cohort"},{"$f":"\"=\"&IF(StudentRptCohort=\"All\",\"*\",StudentRptCohort)","v":"=*"}]
[null,{"$f":"IF(A265=\"\",\"[Select a field name]\",INDEX(FieldNames!$E:$E,MATCH(A265,FieldNames!$A:$A,0)))","v":"[Select a field name]"}]
[null,{"$f":"IF(A266=\"\",\"[Select a field name]\",INDEX(FieldNames!$E:$E,MATCH(A266,FieldNames!$A:$A,0)))","v":"[Select a field name]"}]
[null,{"$f":"IF(A267=\"\",\"[Select a field name]\",INDEX(FieldNames!$E:$E,MATCH(A267,FieldNames!$A:$A,0)))","v":"[Select a field name]"}]
[null,{"$f":"IF(A268=\"\",\"[Select a field name]\",INDEX(FieldNames!$E:$E,MATCH(A268,FieldNames!$A:$A,0)))","v":"[Select a field name]"}]
[null,{"$f":"IF(A269=\"\",\"[Select a field name]\",INDEX(FieldNames!$E:$E,MATCH(A269,FieldNames!$A:$A,0)))","v":"[Select a field name]"}]
[null,{"$f":"IF(A270=\"\",\"[Select a field name]\",INDEX(FieldNames!$E:$E,MATCH(A270,FieldNames!$A:$A,0)))","v":"[Select a field name]"}]
[null,{"$f":"IF(A271=\"\",\"[Select a field name]\",INDEX(FieldNames!$E:$E,MATCH(A271,FieldNames!$A:$A,0)))","v":"[Select a field name]"}]
[null,""]
["GP3Flagged Student Report: Disabilities","GP3Flagged Student Report: Disabilities"]
["Disability flag",{"$f":"IF(A274=\"\",\"[Select a field name]\",INDEX(FieldNames!$E:$E,MATCH(A274,FieldNames!$A:$A,0)))","v":"Any Disability"},{"$f":"\"=1\"","v":"=1"}]
["GP3_Any Flag",{"$f":"IF(A275=\"\",\"[Select a field name]\",INDEX(FieldNames!$E:$E,MATCH(A275,FieldNames!$A:$A,0)))","v":"Quarter 3 Any Flag"},{"$f":"\"=1\"","v":"=1"}]
["Cohort",{"$f":"IF(A276=\"\",\"[Select a field name]\",INDEX(FieldNames!$E:$E,MATCH(A276,FieldNames!$A:$A,0)))","v":"Cohort"},{"$f":"\"=\"&IF(StudentRptCohort=\"All\",\"*\",StudentRptCohort)","v":"=*"}]
[null,{"$f":"IF(A277=\"\",\"[Select a field name]\",INDEX(FieldNames!$E:$E,MATCH(A277,FieldNames!$A:$A,0)))","v":"[Select a field name]"}]
[null,{"$f":"IF(A278=\"\",\"[Select a field name]\",INDEX(FieldNames!$E:$E,MATCH(A278,FieldNames!$A:$A,0)))","v":"[Select a field name]"}]
[null,{"$f":"IF(A279=\"\",\"[Select a field name]\",INDEX(FieldNames!$E:$E,MATCH(A279,FieldNames!$A:$A,0)))","v":"[Select a field name]"}]
[null,{"$f":"IF(A280=\"\",\"[Select a field name]\",INDEX(FieldNames!$E:$E,MATCH(A280,FieldNames!$A:$A,0)))","v":"[Select a field name]"}]
[null,{"$f":"IF(A281=\"\",\"[Select a field name]\",INDEX(FieldNames!$E:$E,MATCH(A281,FieldNames!$A:$A,0)))","v":"[Select a field name]"}]
[null,{"$f":"IF(A282=\"\",\"[Select a field name]\",INDEX(FieldNames!$E:$E,MATCH(A282,FieldNames!$A:$A,0)))","v":"[Select a field name]"}]
[null,{"$f":"IF(A283=\"\",\"[Select a field name]\",INDEX(FieldNames!$E:$E,MATCH(A283,FieldNames!$A:$A,0)))","v":"[Select a field name]"}]
[null,""]
["GP4Flagged Student Report: Disabilities","GP4Flagged Student Report: Disabilities"]
["Disability flag",{"$f":"IF(A286=\"\",\"[Select a field name]\",INDEX(FieldNames!$E:$E,MATCH(A286,FieldNames!$A:$A,0)))","v":"Any Disability"},{"$f":"\"=1\"","v":"=1"}]
["GP4_Any Flag",{"$f":"IF(A287=\"\",\"[Select a field name]\",INDEX(FieldNames!$E:$E,MATCH(A287,FieldNames!$A:$A,0)))","v":"Quarter 4 Any Flag"},{"$f":"\"=1\"","v":"=1"}]
["Cohort",{"$f":"IF(A288=\"\",\"[Select a field name]\",INDEX(FieldNames!$E:$E,MATCH(A288,FieldNames!$A:$A,0)))","v":"Cohort"},{"$f":"\"=\"&IF(StudentRptCohort=\"All\",\"*\",StudentRptCohort)","v":"=*"}]
[null,{"$f":"IF(A289=\"\",\"[Select a field name]\",INDEX(FieldNames!$E:$E,MATCH(A289,FieldNames!$A:$A,0)))","v":"[Select a field name]"}]
[null,{"$f":"IF(A290=\"\",\"[Select a field name]\",INDEX(FieldNames!$E:$E,MATCH(A290,FieldNames!$A:$A,0)))","v":"[Select a field name]"}]
[null,{"$f":"IF(A291=\"\",\"[Select a field name]\",INDEX(FieldNames!$E:$E,MATCH(A291,FieldNames!$A:$A,0)))","v":"[Select a field name]"}]
[null,{"$f":"IF(A292=\"\",\"[Select a field name]\",INDEX(FieldNames!$E:$E,MATCH(A292,FieldNames!$A:$A,0)))","v":"[Select a field name]"}]
[null,{"$f":"IF(A293=\"\",\"[Select a field name]\",INDEX(FieldNames!$E:$E,MATCH(A293,FieldNames!$A:$A,0)))","v":"[Select a field name]"}]
[null,{"$f":"IF(A294=\"\",\"[Select a field name]\",INDEX(FieldNames!$E:$E,MATCH(A294,FieldNames!$A:$A,0)))","v":"[Select a field name]"}]
[null,{"$f":"IF(A295=\"\",\"[Select a field name]\",INDEX(FieldNames!$E:$E,MATCH(A295,FieldNames!$A:$A,0)))","v":"[Select a field name]"}]
[null,""]
["yrFlagged Student Report: Disabilities","yrFlagged Student Report: Disabilities"]
["Disability flag",{"$f":"IF(A298=\"\",\"[Select a field name]\",INDEX(FieldNames!$E:$E,MATCH(A298,FieldNames!$A:$A,0)))","v":"Any Disability"},{"$f":"\"=1\"","v":"=1"}]
["eoy_Any Flag",{"$f":"IF(A299=\"\",\"[Select a field name]\",INDEX(FieldNames!$E:$E,MATCH(A299,FieldNames!$A:$A,0)))","v":"End of Year Any Flag"},{"$f":"\"=1\"","v":"=1"}]
["Cohort",{"$f":"IF(A300=\"\",\"[Select a field name]\",INDEX(FieldNames!$E:$E,MATCH(A300,FieldNames!$A:$A,0)))","v":"Cohort"},{"$f":"\"=\"&IF(StudentRptCohort=\"All\",\"*\",StudentRptCohort)","v":"=*"}]
[null,{"$f":"IF(A301=\"\",\"[Select a field name]\",INDEX(FieldNames!$E:$E,MATCH(A301,FieldNames!$A:$A,0)))","v":"[Select a field name]"}]
[null,{"$f":"IF(A302=\"\",\"[Select a field name]\",INDEX(FieldNames!$E:$E,MATCH(A302,FieldNames!$A:$A,0)))","v":"[Select a field name]"}]
[null,{"$f":"IF(A303=\"\",\"[Select a field name]\",INDEX(FieldNames!$E:$E,MATCH(A303,FieldNames!$A:$A,0)))","v":"[Select a field name]"}]
[null,{"$f":"IF(A304=\"\",\"[Select a field name]\",INDEX(FieldNames!$E:$E,MATCH(A304,FieldNames!$A:$A,0)))","v":"[Select a field name]"}]
[null,{"$f":"IF(A305=\"\",\"[Select a field name]\",INDEX(FieldNames!$E:$E,MATCH(A305,FieldNames!$A:$A,0)))","v":"[Select a field name]"}]
[null,{"$f":"IF(A306=\"\",\"[Select a field name]\",INDEX(FieldNames!$E:$E,MATCH(A306,FieldNames!$A:$A,0)))","v":"[Select a field name]"}]
[null,{"$f":"IF(A307=\"\",\"[Select a field name]\",INDEX(FieldNames!$E:$E,MATCH(A307,FieldNames!$A:$A,0)))","v":"[Select a field name]"}]
[null,""]
["FullFlagged Student Report: Disabilities","FullFlagged Student Report: Disabilities"]
["Disability flag",{"$f":"IF(A310=\"\",\"[Select a field name]\",INDEX(FieldNames!$E:$E,MATCH(A310,FieldNames!$A:$A,0)))","v":"Any Disability"},{"$f":"\"=1\"","v":"=1"}]
["Any flag",{"$f":"IF(A311=\"\",\"[Select a field name]\",INDEX(FieldNames!$E:$E,MATCH(A311,FieldNames!$A:$A,0)))","v":"Any Flag"},{"$f":"\"=1\"","v":"=1"}]
["Cohort",{"$f":"IF(A312=\"\",\"[Select a field name]\",INDEX(FieldNames!$E:$E,MATCH(A312,FieldNames!$A:$A,0)))","v":"Cohort"},{"$f":"\"=\"&IF(StudentRptCohort=\"All\",\"*\",StudentRptCohort)","v":"=*"}]
[null,{"$f":"IF(A313=\"\",\"[Select a field name]\",INDEX(FieldNames!$E:$E,MATCH(A313,FieldNames!$A:$A,0)))","v":"[Select a field name]"}]
[null,{"$f":"IF(A314=\"\",\"[Select a field name]\",INDEX(FieldNames!$E:$E,MATCH(A314,FieldNames!$A:$A,0)))","v":"[Select a field name]"}]
[null,{"$f":"IF(A315=\"\",\"[Select a field name]\",INDEX(FieldNames!$E:$E,MATCH(A315,FieldNames!$A:$A,0)))","v":"[Select a field name]"}]
[null,{"$f":"IF(A316=\"\",\"[Select a field name]\",INDEX(FieldNames!$E:$E,MATCH(A316,FieldNames!$A:$A,0)))","v":"[Select a field name]"}]
[null,{"$f":"IF(A317=\"\",\"[Select a field name]\",INDEX(FieldNames!$E:$E,MATCH(A317,FieldNames!$A:$A,0)))","v":"[Select a field name]"}]
[null,{"$f":"IF(A318=\"\",\"[Select a field name]\",INDEX(FieldNames!$E:$E,MATCH(A318,FieldNames!$A:$A,0)))","v":"[Select a field name]"}]
[null,{"$f":"IF(A319=\"\",\"[Select a field name]\",INDEX(FieldNames!$E:$E,MATCH(A319,FieldNames!$A:$A,0)))","v":"[Select a field name]"}]
[null,""]
["GP1Flagged Student Report: ELL","GP1Flagged Student Report: ELL"]
["ELL flag",{"$f":"IF(A322=\"\",\"[Select a field name]\",INDEX(FieldNames!$E:$E,MATCH(A322,FieldNames!$A:$A,0)))","v":"Any ELL"},{"$f":"\"=1\"","v":"=1"}]
["GP1_Any Flag",{"$f":"IF(A323=\"\",\"[Select a field name]\",INDEX(FieldNames!$E:$E,MATCH(A323,FieldNames!$A:$A,0)))","v":"Quarter 1 Any Flag"},{"$f":"\"=1\"","v":"=1"}]
["Cohort",{"$f":"IF(A324=\"\",\"[Select a field name]\",INDEX(FieldNames!$E:$E,MATCH(A324,FieldNames!$A:$A,0)))","v":"Cohort"},{"$f":"\"=\"&IF(StudentRptCohort=\"All\",\"*\",StudentRptCohort)","v":"=*"}]
[null,{"$f":"IF(A325=\"\",\"[Select a field name]\",INDEX(FieldNames!$E:$E,MATCH(A325,FieldNames!$A:$A,0)))","v":"[Select a field name]"}]
[null,{"$f":"IF(A326=\"\",\"[Select a field name]\",INDEX(FieldNames!$E:$E,MATCH(A326,FieldNames!$A:$A,0)))","v":"[Select a field name]"}]
[null,{"$f":"IF(A327=\"\",\"[Select a field name]\",INDEX(FieldNames!$E:$E,MATCH(A327,FieldNames!$A:$A,0)))","v":"[Select a field name]"}]
[null,{"$f":"IF(A328=\"\",\"[Select a field name]\",INDEX(FieldNames!$E:$E,MATCH(A328,FieldNames!$A:$A,0)))","v":"[Select a field name]"}]
[null,{"$f":"IF(A329=\"\",\"[Select a field name]\",INDEX(FieldNames!$E:$E,MATCH(A329,FieldNames!$A:$A,0)))","v":"[Select a field name]"}]
[null,{"$f":"IF(A330=\"\",\"[Select a field name]\",INDEX(FieldNames!$E:$E,MATCH(A330,FieldNames!$A:$A,0)))","v":"[Select a field name]"}]
[null,{"$f":"IF(A331=\"\",\"[Select a field name]\",INDEX(FieldNames!$E:$E,MATCH(A331,FieldNames!$A:$A,0)))","v":"[Select a field name]"}]
[null,""]
["GP2Flagged Student Report: ELL","GP2Flagged Student Report: ELL"]
["ELL flag",{"$f":"IF(A334=\"\",\"[Select a field name]\",INDEX(FieldNames!$E:$E,MATCH(A334,FieldNames!$A:$A,0)))","v":"Any ELL"},{"$f":"\"=1\"","v":"=1"}]
["GP2_Any Flag",{"$f":"IF(A335=\"\",\"[Select a field name]\",INDEX(FieldNames!$E:$E,MATCH(A335,FieldNames!$A:$A,0)))","v":"Quarter 2 Any Flag"},{"$f":"\"=1\"","v":"=1"}]
["Cohort",{"$f":"IF(A336=\"\",\"[Select a field name]\",INDEX(FieldNames!$E:$E,MATCH(A336,FieldNames!$A:$A,0)))","v":"Cohort"},{"$f":"\"=\"&IF(StudentRptCohort=\"All\",\"*\",StudentRptCohort)","v":"=*"}]
[null,{"$f":"IF(A337=\"\",\"[Select a field name]\",INDEX(FieldNames!$E:$E,MATCH(A337,FieldNames!$A:$A,0)))","v":"[Select a field name]"}]
[null,{"$f":"IF(A338=\"\",\"[Select a field name]\",INDEX(FieldNames!$E:$E,MATCH(A338,FieldNames!$A:$A,0)))","v":"[Select a field name]"}]
[null,{"$f":"IF(A339=\"\",\"[Select a field name]\",INDEX(FieldNames!$E:$E,MATCH(A339,FieldNames!$A:$A,0)))","v":"[Select a field name]"}]
[null,{"$f":"IF(A340=\"\",\"[Select a field name]\",INDEX(FieldNames!$E:$E,MATCH(A340,FieldNames!$A:$A,0)))","v":"[Select a field name]"}]
[null,{"$f":"IF(A341=\"\",\"[Select a field name]\",INDEX(FieldNames!$E:$E,MATCH(A341,FieldNames!$A:$A,0)))","v":"[Select a field name]"}]
[null,{"$f":"IF(A342=\"\",\"[Select a field name]\",INDEX(FieldNames!$E:$E,MATCH(A342,FieldNames!$A:$A,0)))","v":"[Select a field name]"}]
[null,{"$f":"IF(A343=\"\",\"[Select a field name]\",INDEX(FieldNames!$E:$E,MATCH(A343,FieldNames!$A:$A,0)))","v":"[Select a field name]"}]
[null,""]
["GP3Flagged Student Report: ELL","GP3Flagged Student Report: ELL"]
["ELL flag",{"$f":"IF(A346=\"\",\"[Select a field name]\",INDEX(FieldNames!$E:$E,MATCH(A346,FieldNames!$A:$A,0)))","v":"Any ELL"},{"$f":"\"=1\"","v":"=1"}]
["GP3_Any Flag",{"$f":"IF(A347=\"\",\"[Select a field name]\",INDEX(FieldNames!$E:$E,MATCH(A347,FieldNames!$A:$A,0)))","v":"Quarter 3 Any Flag"},{"$f":"\"=1\"","v":"=1"}]
["Cohort",{"$f":"IF(A348=\"\",\"[Select a field name]\",INDEX(FieldNames!$E:$E,MATCH(A348,FieldNames!$A:$A,0)))","v":"Cohort"},{"$f":"\"=\"&IF(StudentRptCohort=\"All\",\"*\",StudentRptCohort)","v":"=*"}]
[null,{"$f":"IF(A349=\"\",\"[Select a field name]\",INDEX(FieldNames!$E:$E,MATCH(A349,FieldNames!$A:$A,0)))","v":"[Select a field name]"}]
[null,{"$f":"IF(A350=\"\",\"[Select a field name]\",INDEX(FieldNames!$E:$E,MATCH(A350,FieldNames!$A:$A,0)))","v":"[Select a field name]"}]
[null,{"$f":"IF(A351=\"\",\"[Select a field name]\",INDEX(FieldNames!$E:$E,MATCH(A351,FieldNames!$A:$A,0)))","v":"[Select a field name]"}]
[null,{"$f":"IF(A352=\"\",\"[Select a field name]\",INDEX(FieldNames!$E:$E,MATCH(A352,FieldNames!$A:$A,0)))","v":"[Select a field name]"}]
[null,{"$f":"IF(A353=\"\",\"[Select a field name]\",INDEX(FieldNames!$E:$E,MATCH(A353,FieldNames!$A:$A,0)))","v":"[Select a field name]"}]
[null,{"$f":"IF(A354=\"\",\"[Select a field name]\",INDEX(FieldNames!$E:$E,MATCH(A354,FieldNames!$A:$A,0)))","v":"[Select a field name]"}]
[null,{"$f":"IF(A355=\"\",\"[Select a field name]\",INDEX(FieldNames!$E:$E,MATCH(A355,FieldNames!$A:$A,0)))","v":"[Select a field name]"}]
[null,""]
["GP4Flagged Student Report: ELL","GP4Flagged Student Report: ELL"]
["ELL flag",{"$f":"IF(A358=\"\",\"[Select a field name]\",INDEX(FieldNames!$E:$E,MATCH(A358,FieldNames!$A:$A,0)))","v":"Any ELL"},{"$f":"\"=1\"","v":"=1"}]
["GP4_Any Flag",{"$f":"IF(A359=\"\",\"[Select a field name]\",INDEX(FieldNames!$E:$E,MATCH(A359,FieldNames!$A:$A,0)))","v":"Quarter 4 Any Flag"},{"$f":"\"=1\"","v":"=1"}]
["Cohort",{"$f":"IF(A360=\"\",\"[Select a field name]\",INDEX(FieldNames!$E:$E,MATCH(A360,FieldNames!$A:$A,0)))","v":"Cohort"},{"$f":"\"=\"&IF(StudentRptCohort=\"All\",\"*\",StudentRptCohort)","v":"=*"}]
[null,{"$f":"IF(A361=\"\",\"[Select a field name]\",INDEX(FieldNames!$E:$E,MATCH(A361,FieldNames!$A:$A,0)))","v":"[Select a field name]"}]
[null,{"$f":"IF(A362=\"\",\"[Select a field name]\",INDEX(FieldNames!$E:$E,MATCH(A362,FieldNames!$A:$A,0)))","v":"[Select a field name]"}]
[null,{"$f":"IF(A363=\"\",\"[Select a field name]\",INDEX(FieldNames!$E:$E,MATCH(A363,FieldNames!$A:$A,0)))","v":"[Select a field name]"}]
[null,{"$f":"IF(A364=\"\",\"[Select a field name]\",INDEX(FieldNames!$E:$E,MATCH(A364,FieldNames!$A:$A,0)))","v":"[Select a field name]"}]
[null,{"$f":"IF(A365=\"\",\"[Select a field name]\",INDEX(FieldNames!$E:$E,MATCH(A365,FieldNames!$A:$A,0)))","v":"[Select a field name]"}]
[null,{"$f":"IF(A366=\"\",\"[Select a field name]\",INDEX(FieldNames!$E:$E,MATCH(A366,FieldNames!$A:$A,0)))","v":"[Select a field name]"}]
[null,{"$f":"IF(A367=\"\",\"[Select a field name]\",INDEX(FieldNames!$E:$E,MATCH(A367,FieldNames!$A:$A,0)))","v":"[Select a field name]"}]
[null,""]
["yrFlagged Student Report: ELL","yrFlagged Student Report: ELL"]
["ELL flag",{"$f":"IF(A370=\"\",\"[Select a field name]\",INDEX(FieldNames!$E:$E,MATCH(A370,FieldNames!$A:$A,0)))","v":"Any ELL"},{"$f":"\"=1\"","v":"=1"}]
["eoy_Any Flag",{"$f":"IF(A371=\"\",\"[Select a field name]\",INDEX(FieldNames!$E:$E,MATCH(A371,FieldNames!$A:$A,0)))","v":"End of Year Any Flag"},{"$f":"\"=1\"","v":"=1"}]
["Cohort",{"$f":"IF(A372=\"\",\"[Select a field name]\",INDEX(FieldNames!$E:$E,MATCH(A372,FieldNames!$A:$A,0)))","v":"Cohort"},{"$f":"\"=\"&IF(StudentRptCohort=\"All\",\"*\",StudentRptCohort)","v":"=*"}]
[null,{"$f":"IF(A373=\"\",\"[Select a field name]\",INDEX(FieldNames!$E:$E,MATCH(A373,FieldNames!$A:$A,0)))","v":"[Select a field name]"}]
[null,{"$f":"IF(A374=\"\",\"[Select a field name]\",INDEX(FieldNames!$E:$E,MATCH(A374,FieldNames!$A:$A,0)))","v":"[Select a field name]"}]
[null,{"$f":"IF(A375=\"\",\"[Select a field name]\",INDEX(FieldNames!$E:$E,MATCH(A375,FieldNames!$A:$A,0)))","v":"[Select a field name]"}]
[null,{"$f":"IF(A376=\"\",\"[Select a field name]\",INDEX(FieldNames!$E:$E,MATCH(A376,FieldNames!$A:$A,0)))","v":"[Select a field name]"}]
[null,{"$f":"IF(A377=\"\",\"[Select a field name]\",INDEX(FieldNames!$E:$E,MATCH(A377,FieldNames!$A:$A,0)))","v":"[Select a field name]"}]
[null,{"$f":"IF(A378=\"\",\"[Select a field name]\",INDEX(FieldNames!$E:$E,MATCH(A378,FieldNames!$A:$A,0)))","v":"[Select a field name]"}]
[null,{"$f":"IF(A379=\"\",\"[Select a field name]\",INDEX(FieldNames!$E:$E,MATCH(A379,FieldNames!$A:$A,0)))","v":"[Select a field name]"}]
[null,""]
["FullFlagged Student Report: ELL","FullFlagged Student Report: ELL"]
["ELL flag",{"$f":"IF(A382=\"\",\"[Select a field name]\",INDEX(FieldNames!$E:$E,MATCH(A382,FieldNames!$A:$A,0)))","v":"Any ELL"},{"$f":"\"=1\"","v":"=1"}]
["Any flag",{"$f":"IF(A383=\"\",\"[Select a field name]\",INDEX(FieldNames!$E:$E,MATCH(A383,FieldNames!$A:$A,0)))","v":"Any Flag"},{"$f":"\"=1\"","v":"=1"}]
["Cohort",{"$f":"IF(A384=\"\",\"[Select a field name]\",INDEX(FieldNames!$E:$E,MATCH(A384,FieldNames!$A:$A,0)))","v":"Cohort"},{"$f":"\"=\"&IF(StudentRptCohort=\"All\",\"*\",StudentRptCohort)","v":"=*"}]
[null,{"$f":"IF(A385=\"\",\"[Select a field name]\",INDEX(FieldNames!$E:$E,MATCH(A385,FieldNames!$A:$A,0)))","v":"[Select a field name]"}]
[null,{"$f":"IF(A386=\"\",\"[Select a field name]\",INDEX(FieldNames!$E:$E,MATCH(A386,FieldNames!$A:$A,0)))","v":"[Select a field name]"}]
[null,{"$f":"IF(A387=\"\",\"[Select a field name]\",INDEX(FieldNames!$E:$E,MATCH(A387,FieldNames!$A:$A,0)))","v":"[Select a field name]"}]
[null,{"$f":"IF(A388=\"\",\"[Select a field name]\",INDEX(FieldNames!$E:$E,MATCH(A388,FieldNames!$A:$A,0)))","v":"[Select a field name]"}]
[null,{"$f":"IF(A389=\"\",\"[Select a field name]\",INDEX(FieldNames!$E:$E,MATCH(A389,FieldNames!$A:$A,0)))","v":"[Select a field name]"}]
[null,{"$f":"IF(A390=\"\",\"[Select a field name]\",INDEX(FieldNames!$E:$E,MATCH(A390,FieldNames!$A:$A,0)))","v":"[Select a field name]"}]
[null,{"$f":"IF(A391=\"\",\"[Select a field name]\",INDEX(FieldNames!$E:$E,MATCH(A391,FieldNames!$A:$A,0)))","v":"[Select a field name]"}]
[null,""]
["GP1Flagged Student Report: Disadvantaged","GP1Flagged Student Report: Disadvantaged"]
["Disadvantaged flag",{"$f":"IF(A394=\"\",\"[Select a field name]\",INDEX(FieldNames!$E:$E,MATCH(A394,FieldNames!$A:$A,0)))","v":"Any Disadvantaged"},{"$f":"\"=1\"","v":"=1"}]
["GP1_Any Flag",{"$f":"IF(A395=\"\",\"[Select a field name]\",INDEX(FieldNames!$E:$E,MATCH(A395,FieldNames!$A:$A,0)))","v":"Quarter 1 Any Flag"},{"$f":"\"=1\"","v":"=1"}]
["Cohort",{"$f":"IF(A396=\"\",\"[Select a field name]\",INDEX(FieldNames!$E:$E,MATCH(A396,FieldNames!$A:$A,0)))","v":"Cohort"},{"$f":"\"=\"&IF(StudentRptCohort=\"All\",\"*\",StudentRptCohort)","v":"=*"}]
[null,{"$f":"IF(A397=\"\",\"[Select a field name]\",INDEX(FieldNames!$E:$E,MATCH(A397,FieldNames!$A:$A,0)))","v":"[Select a field name]"}]
[null,{"$f":"IF(A398=\"\",\"[Select a field name]\",INDEX(FieldNames!$E:$E,MATCH(A398,FieldNames!$A:$A,0)))","v":"[Select a field name]"}]
[null,{"$f":"IF(A399=\"\",\"[Select a field name]\",INDEX(FieldNames!$E:$E,MATCH(A399,FieldNames!$A:$A,0)))","v":"[Select a field name]"}]
[null,{"$f":"IF(A400=\"\",\"[Select a field name]\",INDEX(FieldNames!$E:$E,MATCH(A400,FieldNames!$A:$A,0)))","v":"[Select a field name]"}]
[null,{"$f":"IF(A401=\"\",\"[Select a field name]\",INDEX(FieldNames!$E:$E,MATCH(A401,FieldNames!$A:$A,0)))","v":"[Select a field name]"}]
[null,{"$f":"IF(A402=\"\",\"[Select a field name]\",INDEX(FieldNames!$E:$E,MATCH(A402,FieldNames!$A:$A,0)))","v":"[Select a field name]"}]
[null,{"$f":"IF(A403=\"\",\"[Select a field name]\",INDEX(FieldNames!$E:$E,MATCH(A403,FieldNames!$A:$A,0)))","v":"[Select a field name]"}]
[null,""]
["GP2Flagged Student Report: Disadvantaged","GP2Flagged Student Report: Disadvantaged"]
["Disadvantaged flag",{"$f":"IF(A406=\"\",\"[Select a field name]\",INDEX(FieldNames!$E:$E,MATCH(A406,FieldNames!$A:$A,0)))","v":"Any Disadvantaged"},{"$f":"\"=1\"","v":"=1"}]
["GP2_Any Flag",{"$f":"IF(A407=\"\",\"[Select a field name]\",INDEX(FieldNames!$E:$E,MATCH(A407,FieldNames!$A:$A,0)))","v":"Quarter 2 Any Flag"},{"$f":"\"=1\"","v":"=1"}]
["Cohort",{"$f":"IF(A408=\"\",\"[Select a field name]\",INDEX(FieldNames!$E:$E,MATCH(A408,FieldNames!$A:$A,0)))","v":"Cohort"},{"$f":"\"=\"&IF(StudentRptCohort=\"All\",\"*\",StudentRptCohort)","v":"=*"}]
[null,{"$f":"IF(A409=\"\",\"[Select a field name]\",INDEX(FieldNames!$E:$E,MATCH(A409,FieldNames!$A:$A,0)))","v":"[Select a field name]"}]
[null,{"$f":"IF(A410=\"\",\"[Select a field name]\",INDEX(FieldNames!$E:$E,MATCH(A410,FieldNames!$A:$A,0)))","v":"[Select a field name]"}]
[null,{"$f":"IF(A411=\"\",\"[Select a field name]\",INDEX(FieldNames!$E:$E,MATCH(A411,FieldNames!$A:$A,0)))","v":"[Select a field name]"}]
[null,{"$f":"IF(A412=\"\",\"[Select a field name]\",INDEX(FieldNames!$E:$E,MATCH(A412,FieldNames!$A:$A,0)))","v":"[Select a field name]"}]
[null,{"$f":"IF(A413=\"\",\"[Select a field name]\",INDEX(FieldNames!$E:$E,MATCH(A413,FieldNames!$A:$A,0)))","v":"[Select a field name]"}]
[null,{"$f":"IF(A414=\"\",\"[Select a field name]\",INDEX(FieldNames!$E:$E,MATCH(A414,FieldNames!$A:$A,0)))","v":"[Select a field name]"}]
[null,{"$f":"IF(A415=\"\",\"[Select a field name]\",INDEX(FieldNames!$E:$E,MATCH(A415,FieldNames!$A:$A,0)))","v":"[Select a field name]"}]
[null,""]
["GP3Flagged Student Report: Disadvantaged","GP3Flagged Student Report: Disadvantaged"]
["Disadvantaged flag",{"$f":"IF(A418=\"\",\"[Select a field name]\",INDEX(FieldNames!$E:$E,MATCH(A418,FieldNames!$A:$A,0)))","v":"Any Disadvantaged"},{"$f":"\"=1\"","v":"=1"}]
["GP3_Any Flag",{"$f":"IF(A419=\"\",\"[Select a field name]\",INDEX(FieldNames!$E:$E,MATCH(A419,FieldNames!$A:$A,0)))","v":"Quarter 3 Any Flag"},{"$f":"\"=1\"","v":"=1"}]
["Cohort",{"$f":"IF(A420=\"\",\"[Select a field name]\",INDEX(FieldNames!$E:$E,MATCH(A420,FieldNames!$A:$A,0)))","v":"Cohort"},{"$f":"\"=\"&IF(StudentRptCohort=\"All\",\"*\",StudentRptCohort)","v":"=*"}]
[null,{"$f":"IF(A421=\"\",\"[Select a field name]\",INDEX(FieldNames!$E:$E,MATCH(A421,FieldNames!$A:$A,0)))","v":"[Select a field name]"}]
[null,{"$f":"IF(A422=\"\",\"[Select a field name]\",INDEX(FieldNames!$E:$E,MATCH(A422,FieldNames!$A:$A,0)))","v":"[Select a field name]"}]
[null,{"$f":"IF(A423=\"\",\"[Select a field name]\",INDEX(FieldNames!$E:$E,MATCH(A423,FieldNames!$A:$A,0)))","v":"[Select a field name]"}]
[null,{"$f":"IF(A424=\"\",\"[Select a field name]\",INDEX(FieldNames!$E:$E,MATCH(A424,FieldNames!$A:$A,0)))","v":"[Select a field name]"}]
[null,{"$f":"IF(A425=\"\",\"[Select a field name]\",INDEX(FieldNames!$E:$E,MATCH(A425,FieldNames!$A:$A,0)))","v":"[Select a field name]"}]
[null,{"$f":"IF(A426=\"\",\"[Select a field name]\",INDEX(FieldNames!$E:$E,MATCH(A426,FieldNames!$A:$A,0)))","v":"[Select a field name]"}]
[null,{"$f":"IF(A427=\"\",\"[Select a field name]\",INDEX(FieldNames!$E:$E,MATCH(A427,FieldNames!$A:$A,0)))","v":"[Select a field name]"}]
[null,""]
["GP4Flagged Student Report: Disadvantaged","GP4Flagged Student Report: Disadvantaged"]
["Disadvantaged flag",{"$f":"IF(A430=\"\",\"[Select a field name]\",INDEX(FieldNames!$E:$E,MATCH(A430,FieldNames!$A:$A,0)))","v":"Any Disadvantaged"},{"$f":"\"=1\"","v":"=1"}]
["GP4_Any Flag",{"$f":"IF(A431=\"\",\"[Select a field name]\",INDEX(FieldNames!$E:$E,MATCH(A431,FieldNames!$A:$A,0)))","v":"Quarter 4 Any Flag"},{"$f":"\"=1\"","v":"=1"}]
["Cohort",{"$f":"IF(A432=\"\",\"[Select a field name]\",INDEX(FieldNames!$E:$E,MATCH(A432,FieldNames!$A:$A,0)))","v":"Cohort"},{"$f":"\"=\"&IF(StudentRptCohort=\"All\",\"*\",StudentRptCohort)","v":"=*"}]
[null,{"$f":"IF(A433=\"\",\"[Select a field name]\",INDEX(FieldNames!$E:$E,MATCH(A433,FieldNames!$A:$A,0)))","v":"[Select a field name]"}]
[null,{"$f":"IF(A434=\"\",\"[Select a field name]\",INDEX(FieldNames!$E:$E,MATCH(A434,FieldNames!$A:$A,0)))","v":"[Select a field name]"}]
[null,{"$f":"IF(A435=\"\",\"[Select a field name]\",INDEX(FieldNames!$E:$E,MATCH(A435,FieldNames!$A:$A,0)))","v":"[Select a field name]"}]
[null,{"$f":"IF(A436=\"\",\"[Select a field name]\",INDEX(FieldNames!$E:$E,MATCH(A436,FieldNames!$A:$A,0)))","v":"[Select a field name]"}]
[null,{"$f":"IF(A437=\"\",\"[Select a field name]\",INDEX(FieldNames!$E:$E,MATCH(A437,FieldNames!$A:$A,0)))","v":"[Select a field name]"}]
[null,{"$f":"IF(A438=\"\",\"[Select a field name]\",INDEX(FieldNames!$E:$E,MATCH(A438,FieldNames!$A:$A,0)))","v":"[Select a field name]"}]
[null,{"$f":"IF(A439=\"\",\"[Select a field name]\",INDEX(FieldNames!$E:$E,MATCH(A439,FieldNames!$A:$A,0)))","v":"[Select a field name]"}]
[null,""]
["yrFlagged Student Report: Disadvantaged","yrFlagged Student Report: Disadvantaged"]
["Disadvantaged flag",{"$f":"IF(A442=\"\",\"[Select a field name]\",INDEX(FieldNames!$E:$E,MATCH(A442,FieldNames!$A:$A,0)))","v":"Any Disadvantaged"},{"$f":"\"=1\"","v":"=1"}]
["eoy_Any Flag",{"$f":"IF(A443=\"\",\"[Select a field name]\",INDEX(FieldNames!$E:$E,MATCH(A443,FieldNames!$A:$A,0)))","v":"End of Year Any Flag"},{"$f":"\"=1\"","v":"=1"}]
["Cohort",{"$f":"IF(A444=\"\",\"[Select a field name]\",INDEX(FieldNames!$E:$E,MATCH(A444,FieldNames!$A:$A,0)))","v":"Cohort"},{"$f":"\"=\"&IF(StudentRptCohort=\"All\",\"*\",StudentRptCohort)","v":"=*"}]
[null,{"$f":"IF(A445=\"\",\"[Select a field name]\",INDEX(FieldNames!$E:$E,MATCH(A445,FieldNames!$A:$A,0)))","v":"[Select a field name]"}]
[null,{"$f":"IF(A446=\"\",\"[Select a field name]\",INDEX(FieldNames!$E:$E,MATCH(A446,FieldNames!$A:$A,0)))","v":"[Select a field name]"}]
[null,{"$f":"IF(A447=\"\",\"[Select a field name]\",INDEX(FieldNames!$E:$E,MATCH(A447,FieldNames!$A:$A,0)))","v":"[Select a field name]"}]
[null,{"$f":"IF(A448=\"\",\"[Select a field name]\",INDEX(FieldNames!$E:$E,MATCH(A448,FieldNames!$A:$A,0)))","v":"[Select a field name]"}]
[null,{"$f":"IF(A449=\"\",\"[Select a field name]\",INDEX(FieldNames!$E:$E,MATCH(A449,FieldNames!$A:$A,0)))","v":"[Select a field name]"}]
[null,{"$f":"IF(A450=\"\",\"[Select a field name]\",INDEX(FieldNames!$E:$E,MATCH(A450,FieldNames!$A:$A,0)))","v":"[Select a field name]"}]
[null,{"$f":"IF(A451=\"\",\"[Select a field name]\",INDEX(FieldNames!$E:$E,MATCH(A451,FieldNames!$A:$A,0)))","v":"[Select a field name]"}]
[null,""]
["FullFlagged Student Report: Disadvantaged","FullFlagged Student Report: Disadvantaged"]
["Disadvantaged flag",{"$f":"IF(A454=\"\",\"[Select a field name]\",INDEX(FieldNames!$E:$E,MATCH(A454,FieldNames!$A:$A,0)))","v":"Any Disadvantaged"},{"$f":"\"=1\"","v":"=1"}]
["Any flag",{"$f":"IF(A455=\"\",\"[Select a field name]\",INDEX(FieldNames!$E:$E,MATCH(A455,FieldNames!$A:$A,0)))","v":"Any Flag"},{"$f":"\"=1\"","v":"=1"}]
["Cohort",{"$f":"IF(A456=\"\",\"[Select a field name]\",INDEX(FieldNames!$E:$E,MATCH(A456,FieldNames!$A:$A,0)))","v":"Cohort"},{"$f":"\"=\"&IF(StudentRptCohort=\"All\",\"*\",StudentRptCohort)","v":"=*"}]
[null,{"$f":"IF(A457=\"\",\"[Select a field name]\",INDEX(FieldNames!$E:$E,MATCH(A457,FieldNames!$A:$A,0)))","v":"[Select a field name]"}]
[null,{"$f":"IF(A458=\"\",\"[Select a field name]\",INDEX(FieldNames!$E:$E,MATCH(A458,FieldNames!$A:$A,0)))","v":"[Select a field name]"}]
[null,{"$f":"IF(A459=\"\",\"[Select a field name]\",INDEX(FieldNames!$E:$E,MATCH(A459,FieldNames!$A:$A,0)))","v":"[Select a field name]"}]
[null,{"$f":"IF(A460=\"\",\"[Select a field name]\",INDEX(FieldNames!$E:$E,MATCH(A460,FieldNames!$A:$A,0)))","v":"[Select a field name]"}]
[null,{"$f":"IF(A461=\"\",\"[Select a field name]\",INDEX(FieldNames!$E:$E,MATCH(A461,FieldNames!$A:$A,0)))","v":"[Select a field name]"}]
[null,{"$f":"IF(A462=\"\",\"[Select a field name]\",INDEX(FieldNames!$E:$E,MATCH(A462,FieldNames!$A:$A,0)))","v":"[Select a field name]"}]
[null,{"$f":"IF(A463=\"\",\"[Select a field name]\",INDEX(FieldNames!$E:$E,MATCH(A463,FieldNames!$A:$A,0)))","v":"[Select a field name]"}]
[null,""]
["GP1Intervention report","GP1Intervention report"]
["GP1 Interventions",{"$f":"IF(A466=\"\",\"[Select a field name]\",INDEX(FieldNames!$E:$E,MATCH(A466,FieldNames!$A:$A,0)))","v":"Quarter 1 Interventions"},{"$f":"\"=*\"&INDEX(CurrInterventions,o_StudentLevelRpt!$F$7)&\"*\"","v":"=**"}]
["Cohort",{"$f":"IF(A467=\"\",\"[Select a field name]\",INDEX(FieldNames!$E:$E,MATCH(A467,FieldNames!$A:$A,0)))","v":"Cohort"},{"$f":"\"=\"&IF(StudentRptCohort=\"All\",\"*\",StudentRptCohort)","v":"=*"}]
[null,{"$f":"IF(A468=\"\",\"[Select a field name]\",INDEX(FieldNames!$E:$E,MATCH(A468,FieldNames!$A:$A,0)))","v":"[Select a field name]"}]
[null,{"$f":"IF(A469=\"\",\"[Select a field name]\",INDEX(FieldNames!$E:$E,MATCH(A469,FieldNames!$A:$A,0)))","v":"[Select a field name]"}]
[null,{"$f":"IF(A470=\"\",\"[Select a field name]\",INDEX(FieldNames!$E:$E,MATCH(A470,FieldNames!$A:$A,0)))","v":"[Select a field name]"}]
[null,{"$f":"IF(A471=\"\",\"[Select a field name]\",INDEX(FieldNames!$E:$E,MATCH(A471,FieldNames!$A:$A,0)))","v":"[Select a field name]"}]
[null,{"$f":"IF(A472=\"\",\"[Select a field name]\",INDEX(FieldNames!$E:$E,MATCH(A472,FieldNames!$A:$A,0)))","v":"[Select a field name]"}]
[null,{"$f":"IF(A473=\"\",\"[Select a field name]\",INDEX(FieldNames!$E:$E,MATCH(A473,FieldNames!$A:$A,0)))","v":"[Select a field name]"}]
[null,{"$f":"IF(A474=\"\",\"[Select a field name]\",INDEX(FieldNames!$E:$E,MATCH(A474,FieldNames!$A:$A,0)))","v":"[Select a field name]"}]
[null,{"$f":"IF(A475=\"\",\"[Select a field name]\",INDEX(FieldNames!$E:$E,MATCH(A475,FieldNames!$A:$A,0)))","v":"[Select a field name]"}]
[null,""]
["GP2Intervention report","GP2Intervention report"]
["GP2 Interventions",{"$f":"IF(A478=\"\",\"[Select a field name]\",INDEX(FieldNames!$E:$E,MATCH(A478,FieldNames!$A:$A,0)))","v":"Quarter 2 Interventions"},{"$f":"\"=*\"&INDEX(CurrInterventions,o_StudentLevelRpt!$F$7)&\"*\"","v":"=**"}]
["Cohort",{"$f":"IF(A479=\"\",\"[Select a field name]\",INDEX(FieldNames!$E:$E,MATCH(A479,FieldNames!$A:$A,0)))","v":"Cohort"},{"$f":"\"=\"&IF(StudentRptCohort=\"All\",\"*\",StudentRptCohort)","v":"=*"}]
[null,{"$f":"IF(A480=\"\",\"[Select a field name]\",INDEX(FieldNames!$E:$E,MATCH(A480,FieldNames!$A:$A,0)))","v":"[Select a field name]"}]
[null,{"$f":"IF(A481=\"\",\"[Select a field name]\",INDEX(FieldNames!$E:$E,MATCH(A481,FieldNames!$A:$A,0)))","v":"[Select a field name]"}]
[null,{"$f":"IF(A482=\"\",\"[Select a field name]\",INDEX(FieldNames!$E:$E,MATCH(A482,FieldNames!$A:$A,0)))","v":"[Select a field name]"}]
[null,{"$f":"IF(A483=\"\",\"[Select a field name]\",INDEX(FieldNames!$E:$E,MATCH(A483,FieldNames!$A:$A,0)))","v":"[Select a field name]"}]
[null,{"$f":"IF(A484=\"\",\"[Select a field name]\",INDEX(FieldNames!$E:$E,MATCH(A484,FieldNames!$A:$A,0)))","v":"[Select a field name]"}]
[null,{"$f":"IF(A485=\"\",\"[Select a field name]\",INDEX(FieldNames!$E:$E,MATCH(A485,FieldNames!$A:$A,0)))","v":"[Select a field name]"}]
[null,{"$f":"IF(A486=\"\",\"[Select a field name]\",INDEX(FieldNames!$E:$E,MATCH(A486,FieldNames!$A:$A,0)))","v":"[Select a field name]"}]
[null,{"$f":"IF(A487=\"\",\"[Select a field name]\",INDEX(FieldNames!$E:$E,MATCH(A487,FieldNames!$A:$A,0)))","v":"[Select a field name]"}]
[null,""]
["GP3Intervention report","GP3Intervention report"]
["GP3 Interventions",{"$f":"IF(A490=\"\",\"[Select a field name]\",INDEX(FieldNames!$E:$E,MATCH(A490,FieldNames!$A:$A,0)))","v":"Quarter 3 Interventions"},{"$f":"\"=*\"&INDEX(CurrInterventions,o_StudentLevelRpt!$F$7)&\"*\"","v":"=**"}]
["Cohort",{"$f":"IF(A491=\"\",\"[Select a field name]\",INDEX(FieldNames!$E:$E,MATCH(A491,FieldNames!$A:$A,0)))","v":"Cohort"},{"$f":"\"=\"&IF(StudentRptCohort=\"All\",\"*\",StudentRptCohort)","v":"=*"}]
[null,{"$f":"IF(A492=\"\",\"[Select a field name]\",INDEX(FieldNames!$E:$E,MATCH(A492,FieldNames!$A:$A,0)))","v":"[Select a field name]"}]
[null,{"$f":"IF(A493=\"\",\"[Select a field name]\",INDEX(FieldNames!$E:$E,MATCH(A493,FieldNames!$A:$A,0)))","v":"[Select a field name]"}]
[null,{"$f":"IF(A494=\"\",\"[Select a field name]\",INDEX(FieldNames!$E:$E,MATCH(A494,FieldNames!$A:$A,0)))","v":"[Select a field name]"}]
[null,{"$f":"IF(A495=\"\",\"[Select a field name]\",INDEX(FieldNames!$E:$E,MATCH(A495,FieldNames!$A:$A,0)))","v":"[Select a field name]"}]
[null,{"$f":"IF(A496=\"\",\"[Select a field name]\",INDEX(FieldNames!$E:$E,MATCH(A496,FieldNames!$A:$A,0)))","v":"[Select a field name]"}]
[null,{"$f":"IF(A497=\"\",\"[Select a field name]\",INDEX(FieldNames!$E:$E,MATCH(A497,FieldNames!$A:$A,0)))","v":"[Select a field name]"}]
[null,{"$f":"IF(A498=\"\",\"[Select a field name]\",INDEX(FieldNames!$E:$E,MATCH(A498,FieldNames!$A:$A,0)))","v":"[Select a field name]"}]
[null,{"$f":"IF(A499=\"\",\"[Select a field name]\",INDEX(FieldNames!$E:$E,MATCH(A499,FieldNames!$A:$A,0)))","v":"[Select a field name]"}]
[null,""]
["GP4Intervention report","GP4Intervention report"]
["GP4 Interventions",{"$f":"IF(A502=\"\",\"[Select a field name]\",INDEX(FieldNames!$E:$E,MATCH(A502,FieldNames!$A:$A,0)))","v":"Quarter 4 Interventions"},{"$f":"\"=*\"&INDEX(CurrInterventions,o_StudentLevelRpt!$F$7)&\"*\"","v":"=**"}]
["Cohort",{"$f":"IF(A503=\"\",\"[Select a field name]\",INDEX(FieldNames!$E:$E,MATCH(A503,FieldNames!$A:$A,0)))","v":"Cohort"},{"$f":"\"=\"&IF(StudentRptCohort=\"All\",\"*\",StudentRptCohort)","v":"=*"}]
[null,{"$f":"IF(A504=\"\",\"[Select a field name]\",INDEX(FieldNames!$E:$E,MATCH(A504,FieldNames!$A:$A,0)))","v":"[Select a field name]"}]
[null,{"$f":"IF(A505=\"\",\"[Select a field name]\",INDEX(FieldNames!$E:$E,MATCH(A505,FieldNames!$A:$A,0)))","v":"[Select a field name]"}]
[null,{"$f":"IF(A506=\"\",\"[Select a field name]\",INDEX(FieldNames!$E:$E,MATCH(A506,FieldNames!$A:$A,0)))","v":"[Select a field name]"}]
[null,{"$f":"IF(A507=\"\",\"[Select a field name]\",INDEX(FieldNames!$E:$E,MATCH(A507,FieldNames!$A:$A,0)))","v":"[Select a field name]"}]
[null,{"$f":"IF(A508=\"\",\"[Select a field name]\",INDEX(FieldNames!$E:$E,MATCH(A508,FieldNames!$A:$A,0)))","v":"[Select a field name]"}]
[null,{"$f":"IF(A509=\"\",\"[Select a field name]\",INDEX(FieldNames!$E:$E,MATCH(A509,FieldNames!$A:$A,0)))","v":"[Select a field name]"}]
[null,{"$f":"IF(A510=\"\",\"[Select a field name]\",INDEX(FieldNames!$E:$E,MATCH(A510,FieldNames!$A:$A,0)))","v":"[Select a field name]"}]
[null,{"$f":"IF(A511=\"\",\"[Select a field name]\",INDEX(FieldNames!$E:$E,MATCH(A511,FieldNames!$A:$A,0)))","v":"[Select a field name]"}]
[null,""]
["yrIntervention report","yrIntervention report"]
["All Interventions",{"$f":"IF(A514=\"\",\"[Select a field name]\",INDEX(FieldNames!$E:$E,MATCH(A514,FieldNames!$A:$A,0)))","v":"All Interventions"},{"$f":"\"=*\"&INDEX(CurrInterventions,o_StudentLevelRpt!$F$7)&\"*\"","v":"=**"}]
["Cohort",{"$f":"IF(A515=\"\",\"[Select a field name]\",INDEX(FieldNames!$E:$E,MATCH(A515,FieldNames!$A:$A,0)))","v":"Cohort"},{"$f":"\"=\"&IF(StudentRptCohort=\"All\",\"*\",StudentRptCohort)","v":"=*"}]
[null,{"$f":"IF(A516=\"\",\"[Select a field name]\",INDEX(FieldNames!$E:$E,MATCH(A516,FieldNames!$A:$A,0)))","v":"[Select a field name]"}]
[null,{"$f":"IF(A517=\"\",\"[Select a field name]\",INDEX(FieldNames!$E:$E,MATCH(A517,FieldNames!$A:$A,0)))","v":"[Select a field name]"}]
[null,{"$f":"IF(A518=\"\",\"[Select a field name]\",INDEX(FieldNames!$E:$E,MATCH(A518,FieldNames!$A:$A,0)))","v":"[Select a field name]"}]
[null,{"$f":"IF(A519=\"\",\"[Select a field name]\",INDEX(FieldNames!$E:$E,MATCH(A519,FieldNames!$A:$A,0)))","v":"[Select a field name]"}]
[null,{"$f":"IF(A520=\"\",\"[Select a field name]\",INDEX(FieldNames!$E:$E,MATCH(A520,FieldNames!$A:$A,0)))","v":"[Select a field name]"}]
[null,{"$f":"IF(A521=\"\",\"[Select a field name]\",INDEX(FieldNames!$E:$E,MATCH(A521,FieldNames!$A:$A,0)))","v":"[Select a field name]"}]
[null,{"$f":"IF(A522=\"\",\"[Select a field name]\",INDEX(FieldNames!$E:$E,MATCH(A522,FieldNames!$A:$A,0)))","v":"[Select a field name]"}]
[null,{"$f":"IF(A523=\"\",\"[Select a field name]\",INDEX(FieldNames!$E:$E,MATCH(A523,FieldNames!$A:$A,0)))","v":"[Select a field name]"}]
[null,""]
["FullIntervention report","FullIntervention report"]
["All Interventions",{"$f":"IF(A526=\"\",\"[Select a field name]\",INDEX(FieldNames!$E:$E,MATCH(A526,FieldNames!$A:$A,0)))","v":"All Interventions"},{"$f":"\"=*\"&INDEX(CurrInterventions,o_StudentLevelRpt!$F$7)&\"*\"","v":"=**"}]
["Cohort",{"$f":"IF(A527=\"\",\"[Select a field name]\",INDEX(FieldNames!$E:$E,MATCH(A527,FieldNames!$A:$A,0)))","v":"Cohort"},{"$f":"\"=\"&IF(StudentRptCohort=\"All\",\"*\",StudentRptCohort)","v":"=*"}]
[null,{"$f":"IF(A528=\"\",\"[Select a field name]\",INDEX(FieldNames!$E:$E,MATCH(A528,FieldNames!$A:$A,0)))","v":"[Select a field name]"}]
[null,{"$f":"IF(A529=\"\",\"[Select a field name]\",INDEX(FieldNames!$E:$E,MATCH(A529,FieldNames!$A:$A,0)))","v":"[Select a field name]"}]
[null,{"$f":"IF(A530=\"\",\"[Select a field name]\",INDEX(FieldNames!$E:$E,MATCH(A530,FieldNames!$A:$A,0)))","v":"[Select a field name]"}]
[null,{"$f":"IF(A531=\"\",\"[Select a field name]\",INDEX(FieldNames!$E:$E,MATCH(A531,FieldNames!$A:$A,0)))","v":"[Select a field name]"}]
[null,{"$f":"IF(A532=\"\",\"[Select a field name]\",INDEX(FieldNames!$E:$E,MATCH(A532,FieldNames!$A:$A,0)))","v":"[Select a field name]"}]
[null,{"$f":"IF(A533=\"\",\"[Select a field name]\",INDEX(FieldNames!$E:$E,MATCH(A533,FieldNames!$A:$A,0)))","v":"[Select a field name]"}]
[null,{"$f":"IF(A534=\"\",\"[Select a field name]\",INDEX(FieldNames!$E:$E,MATCH(A534,FieldNames!$A:$A,0)))","v":"[Select a field name]"}]
[null,{"$f":"IF(A535=\"\",\"[Select a field name]\",INDEX(FieldNames!$E:$E,MATCH(A535,FieldNames!$A:$A,0)))","v":"[Select a field name]"}]
[null,""]
["Incoming school interventions","Incoming school interventions"]
["pre-HS Indicator",{"$f":"IF(A538=\"\",\"[Select a field name]\",INDEX(FieldNames!$E:$E,MATCH(A538,FieldNames!$A:$A,0)))","v":"Incoming Risk Indicator"},{"$f":"\"=1\"","v":"=1"}]
["Cohort",{"$f":"IF(A539=\"\",\"[Select a field name]\",INDEX(FieldNames!$E:$E,MATCH(A539,FieldNames!$A:$A,0)))","v":"Cohort"},{"$f":"\"=\"&IF(StudentRptCohort=\"All\",\"*\",StudentRptCohort)","v":"=*"}]
[null,{"$f":"IF(A540=\"\",\"[Select a field name]\",INDEX(FieldNames!$E:$E,MATCH(A540,FieldNames!$A:$A,0)))","v":"[Select a field name]"}]
[null,{"$f":"IF(A541=\"\",\"[Select a field name]\",INDEX(FieldNames!$E:$E,MATCH(A541,FieldNames!$A:$A,0)))","v":"[Select a field name]"}]
[null,{"$f":"IF(A542=\"\",\"[Select a field name]\",INDEX(FieldNames!$E:$E,MATCH(A542,FieldNames!$A:$A,0)))","v":"[Select a field name]"}]
[null,{"$f":"IF(A543=\"\",\"[Select a field name]\",INDEX(FieldNames!$E:$E,MATCH(A543,FieldNames!$A:$A,0)))","v":"[Select a field name]"}]
[null,{"$f":"IF(A544=\"\",\"[Select a field name]\",INDEX(FieldNames!$E:$E,MATCH(A544,FieldNames!$A:$A,0)))","v":"[Select a field name]"}]
[null,{"$f":"IF(A545=\"\",\"[Select a field name]\",INDEX(FieldNames!$E:$E,MATCH(A545,FieldNames!$A:$A,0)))","v":"[Select a field name]"}]
[null,{"$f":"IF(A546=\"\",\"[Select a field name]\",INDEX(FieldNames!$E:$E,MATCH(A546,FieldNames!$A:$A,0)))","v":"[Select a field name]"}]
[null,{"$f":"IF(A547=\"\",\"[Select a field name]\",INDEX(FieldNames!$E:$E,MATCH(A547,FieldNames!$A:$A,0)))","v":"[Select a field name]"}]
[null,""]
["Overage Student Report","Overage Student Report"]
["Overage",{"$f":"IF(A550=\"\",\"[Select a field name]\",INDEX(FieldNames!$E:$E,MATCH(A550,FieldNames!$A:$A,0)))","v":"Student is Overage"},{"$f":"\"=1\"","v":"=1"}]
["Cohort",{"$f":"IF(A551=\"\",\"[Select a field name]\",INDEX(FieldNames!$E:$E,MATCH(A551,FieldNames!$A:$A,0)))","v":"Cohort"},{"$f":"\"=\"&IF(StudentRptCohort=\"All\",\"*\",StudentRptCohort)","v":"=*"}]
[null,{"$f":"IF(A552=\"\",\"[Select a field name]\",INDEX(FieldNames!$E:$E,MATCH(A552,FieldNames!$A:$A,0)))","v":"[Select a field name]"}]
[null,{"$f":"IF(A553=\"\",\"[Select a field name]\",INDEX(FieldNames!$E:$E,MATCH(A553,FieldNames!$A:$A,0)))","v":"[Select a field name]"}]
[null,{"$f":"IF(A554=\"\",\"[Select a field name]\",INDEX(FieldNames!$E:$E,MATCH(A554,FieldNames!$A:$A,0)))","v":"[Select a field name]"}]
[null,{"$f":"IF(A555=\"\",\"[Select a field name]\",INDEX(FieldNames!$E:$E,MATCH(A555,FieldNames!$A:$A,0)))","v":"[Select a field name]"}]
[null,{"$f":"IF(A556=\"\",\"[Select a field name]\",INDEX(FieldNames!$E:$E,MATCH(A556,FieldNames!$A:$A,0)))","v":"[Select a field name]"}]
[null,{"$f":"IF(A557=\"\",\"[Select a field name]\",INDEX(FieldNames!$E:$E,MATCH(A557,FieldNames!$A:$A,0)))","v":"[Select a field name]"}]
[null,{"$f":"IF(A558=\"\",\"[Select a field name]\",INDEX(FieldNames!$E:$E,MATCH(A558,FieldNames!$A:$A,0)))","v":"[Select a field name]"}]
[null,{"$f":"IF(A559=\"\",\"[Select a field name]\",INDEX(FieldNames!$E:$E,MATCH(A559,FieldNames!$A:$A,0)))","v":"[Select a field name]"}]
[null,""]
["GP1Student Dropout Report","GP1Student Dropout Report"]
["Enrollment status",{"$f":"IF(A562=\"\",\"[Select a field name]\",INDEX(FieldNames!$E:$E,MATCH(A562,FieldNames!$A:$A,0)))","v":"Enrollment Status"},{"$f":"\"=Dropped out\"","v":"=Dropped out"}]
["Cohort",{"$f":"IF(A563=\"\",\"[Select a field name]\",INDEX(FieldNames!$E:$E,MATCH(A563,FieldNames!$A:$A,0)))","v":"Cohort"},{"$f":"\"=\"&IF(StudentRptCohort=\"All\",\"*\",StudentRptCohort)","v":"=*"}]
["Drop/transfer out",{"$f":"IF(A564=\"\",\"[Select a field name]\",INDEX(FieldNames!$E:$E,MATCH(A564,FieldNames!$A:$A,0)))","v":"Enrollment Status and GP of Status Change"},{"$f":"\"=Dropped out1\"","v":"=Dropped out1"}]
[null,{"$f":"IF(A565=\"\",\"[Select a field name]\",INDEX(FieldNames!$E:$E,MATCH(A565,FieldNames!$A:$A,0)))","v":"[Select a field name]"}]
[null,{"$f":"IF(A566=\"\",\"[Select a field name]\",INDEX(FieldNames!$E:$E,MATCH(A566,FieldNames!$A:$A,0)))","v":"[Select a field name]"}]
[null,{"$f":"IF(A567=\"\",\"[Select a field name]\",INDEX(FieldNames!$E:$E,MATCH(A567,FieldNames!$A:$A,0)))","v":"[Select a field name]"}]
[null,{"$f":"IF(A568=\"\",\"[Select a field name]\",INDEX(FieldNames!$E:$E,MATCH(A568,FieldNames!$A:$A,0)))","v":"[Select a field name]"}]
[null,{"$f":"IF(A569=\"\",\"[Select a field name]\",INDEX(FieldNames!$E:$E,MATCH(A569,FieldNames!$A:$A,0)))","v":"[Select a field name]"}]
[null,{"$f":"IF(A570=\"\",\"[Select a field name]\",INDEX(FieldNames!$E:$E,MATCH(A570,FieldNames!$A:$A,0)))","v":"[Select a field name]"}]
[null,{"$f":"IF(A571=\"\",\"[Select a field name]\",INDEX(FieldNames!$E:$E,MATCH(A571,FieldNames!$A:$A,0)))","v":"[Select a field name]"}]
[null,""]
["GP2Student Dropout Report","GP2Student Dropout Report"]
["Enrollment status",{"$f":"IF(A574=\"\",\"[Select a field name]\",INDEX(FieldNames!$E:$E,MATCH(A574,FieldNames!$A:$A,0)))","v":"Enrollment Status"},{"$f":"\"=Dropped out\"","v":"=Dropped out"}]
["Cohort",{"$f":"IF(A575=\"\",\"[Select a field name]\",INDEX(FieldNames!$E:$E,MATCH(A575,FieldNames!$A:$A,0)))","v":"Cohort"},{"$f":"\"=\"&IF(StudentRptCohort=\"All\",\"*\",StudentRptCohort)","v":"=*"}]
["Drop/transfer out",{"$f":"IF(A576=\"\",\"[Select a field name]\",INDEX(FieldNames!$E:$E,MATCH(A576,FieldNames!$A:$A,0)))","v":"Enrollment Status and GP of Status Change"},{"$f":"\"=Dropped out2\"","v":"=Dropped out2"}]
[null,{"$f":"IF(A577=\"\",\"[Select a field name]\",INDEX(FieldNames!$E:$E,MATCH(A577,FieldNames!$A:$A,0)))","v":"[Select a field name]"}]
[null,{"$f":"IF(A578=\"\",\"[Select a field name]\",INDEX(FieldNames!$E:$E,MATCH(A578,FieldNames!$A:$A,0)))","v":"[Select a field name]"}]
[null,{"$f":"IF(A579=\"\",\"[Select a field name]\",INDEX(FieldNames!$E:$E,MATCH(A579,FieldNames!$A:$A,0)))","v":"[Select a field name]"}]
[null,{"$f":"IF(A580=\"\",\"[Select a field name]\",INDEX(FieldNames!$E:$E,MATCH(A580,FieldNames!$A:$A,0)))","v":"[Select a field name]"}]
[null,{"$f":"IF(A581=\"\",\"[Select a field name]\",INDEX(FieldNames!$E:$E,MATCH(A581,FieldNames!$A:$A,0)))","v":"[Select a field name]"}]
[null,{"$f":"IF(A582=\"\",\"[Select a field name]\",INDEX(FieldNames!$E:$E,MATCH(A582,FieldNames!$A:$A,0)))","v":"[Select a field name]"}]
[null,{"$f":"IF(A583=\"\",\"[Select a field name]\",INDEX(FieldNames!$E:$E,MATCH(A583,FieldNames!$A:$A,0)))","v":"[Select a field name]"}]
[null,""]
["GP3Student Dropout Report","GP3Student Dropout Report"]
["Enrollment status",{"$f":"IF(A586=\"\",\"[Select a field name]\",INDEX(FieldNames!$E:$E,MATCH(A586,FieldNames!$A:$A,0)))","v":"Enrollment Status"},{"$f":"\"=Dropped out\"","v":"=Dropped out"}]
["Cohort",{"$f":"IF(A587=\"\",\"[Select a field name]\",INDEX(FieldNames!$E:$E,MATCH(A587,FieldNames!$A:$A,0)))","v":"Cohort"},{"$f":"\"=\"&IF(StudentRptCohort=\"All\",\"*\",StudentRptCohort)","v":"=*"}]
["Drop/transfer out",{"$f":"IF(A588=\"\",\"[Select a field name]\",INDEX(FieldNames!$E:$E,MATCH(A588,FieldNames!$A:$A,0)))","v":"Enrollment Status and GP of Status Change"},{"$f":"\"=Dropped out3\"","v":"=Dropped out3"}]
[null,{"$f":"IF(A589=\"\",\"[Select a field name]\",INDEX(FieldNames!$E:$E,MATCH(A589,FieldNames!$A:$A,0)))","v":"[Select a field name]"}]
[null,{"$f":"IF(A590=\"\",\"[Select a field name]\",INDEX(FieldNames!$E:$E,MATCH(A590,FieldNames!$A:$A,0)))","v":"[Select a field name]"}]
[null,{"$f":"IF(A591=\"\",\"[Select a field name]\",INDEX(FieldNames!$E:$E,MATCH(A591,FieldNames!$A:$A,0)))","v":"[Select a field name]"}]
[null,{"$f":"IF(A592=\"\",\"[Select a field name]\",INDEX(FieldNames!$E:$E,MATCH(A592,FieldNames!$A:$A,0)))","v":"[Select a field name]"}]
[null,{"$f":"IF(A593=\"\",\"[Select a field name]\",INDEX(FieldNames!$E:$E,MATCH(A593,FieldNames!$A:$A,0)))","v":"[Select a field name]"}]
[null,{"$f":"IF(A594=\"\",\"[Select a field name]\",INDEX(FieldNames!$E:$E,MATCH(A594,FieldNames!$A:$A,0)))","v":"[Select a field name]"}]
[null,{"$f":"IF(A595=\"\",\"[Select a field name]\",INDEX(FieldNames!$E:$E,MATCH(A595,FieldNames!$A:$A,0)))","v":"[Select a field name]"}]
[null,""]
["GP4Student Dropout Report","GP4Student Dropout Report"]
["Enrollment status",{"$f":"IF(A598=\"\",\"[Select a field name]\",INDEX(FieldNames!$E:$E,MATCH(A598,FieldNames!$A:$A,0)))","v":"Enrollment Status"},{"$f":"\"=Dropped out\"","v":"=Dropped out"}]
["Cohort",{"$f":"IF(A599=\"\",\"[Select a field name]\",INDEX(FieldNames!$E:$E,MATCH(A599,FieldNames!$A:$A,0)))","v":"Cohort"},{"$f":"\"=\"&IF(StudentRptCohort=\"All\",\"*\",StudentRptCohort)","v":"=*"}]
["Drop/transfer out",{"$f":"IF(A600=\"\",\"[Select a field name]\",INDEX(FieldNames!$E:$E,MATCH(A600,FieldNames!$A:$A,0)))","v":"Enrollment Status and GP of Status Change"},{"$f":"\"=Dropped out4\"","v":"=Dropped out4"}]
[null,{"$f":"IF(A601=\"\",\"[Select a field name]\",INDEX(FieldNames!$E:$E,MATCH(A601,FieldNames!$A:$A,0)))","v":"[Select a field name]"}]
[null,{"$f":"IF(A602=\"\",\"[Select a field name]\",INDEX(FieldNames!$E:$E,MATCH(A602,FieldNames!$A:$A,0)))","v":"[Select a field name]"}]
[null,{"$f":"IF(A603=\"\",\"[Select a field name]\",INDEX(FieldNames!$E:$E,MATCH(A603,FieldNames!$A:$A,0)))","v":"[Select a field name]"}]
[null,{"$f":"IF(A604=\"\",\"[Select a field name]\",INDEX(FieldNames!$E:$E,MATCH(A604,FieldNames!$A:$A,0)))","v":"[Select a field name]"}]
[null,{"$f":"IF(A605=\"\",\"[Select a field name]\",INDEX(FieldNames!$E:$E,MATCH(A605,FieldNames!$A:$A,0)))","v":"[Select a field name]"}]
[null,{"$f":"IF(A606=\"\",\"[Select a field name]\",INDEX(FieldNames!$E:$E,MATCH(A606,FieldNames!$A:$A,0)))","v":"[Select a field name]"}]
[null,{"$f":"IF(A607=\"\",\"[Select a field name]\",INDEX(FieldNames!$E:$E,MATCH(A607,FieldNames!$A:$A,0)))","v":"[Select a field name]"}]
[null,""]
["yrStudent Dropout Report","yrStudent Dropout Report"]
["Enrollment status",{"$f":"IF(A610=\"\",\"[Select a field name]\",INDEX(FieldNames!$E:$E,MATCH(A610,FieldNames!$A:$A,0)))","v":"Enrollment Status"},{"$f":"\"=Dropped out\"","v":"=Dropped out"}]
["Cohort",{"$f":"IF(A611=\"\",\"[Select a field name]\",INDEX(FieldNames!$E:$E,MATCH(A611,FieldNames!$A:$A,0)))","v":"Cohort"},{"$f":"\"=\"&IF(StudentRptCohort=\"All\",\"*\",StudentRptCohort)","v":"=*"}]
[null,{"$f":"IF(A612=\"\",\"[Select a field name]\",INDEX(FieldNames!$E:$E,MATCH(A612,FieldNames!$A:$A,0)))","v":"[Select a field name]"}]
[null,{"$f":"IF(A613=\"\",\"[Select a field name]\",INDEX(FieldNames!$E:$E,MATCH(A613,FieldNames!$A:$A,0)))","v":"[Select a field name]"}]
[null,{"$f":"IF(A614=\"\",\"[Select a field name]\",INDEX(FieldNames!$E:$E,MATCH(A614,FieldNames!$A:$A,0)))","v":"[Select a field name]"}]
[null,{"$f":"IF(A615=\"\",\"[Select a field name]\",INDEX(FieldNames!$E:$E,MATCH(A615,FieldNames!$A:$A,0)))","v":"[Select a field name]"}]
[null,{"$f":"IF(A616=\"\",\"[Select a field name]\",INDEX(FieldNames!$E:$E,MATCH(A616,FieldNames!$A:$A,0)))","v":"[Select a field name]"}]
[null,{"$f":"IF(A617=\"\",\"[Select a field name]\",INDEX(FieldNames!$E:$E,MATCH(A617,FieldNames!$A:$A,0)))","v":"[Select a field name]"}]
[null,{"$f":"IF(A618=\"\",\"[Select a field name]\",INDEX(FieldNames!$E:$E,MATCH(A618,FieldNames!$A:$A,0)))","v":"[Select a field name]"}]
[null,{"$f":"IF(A619=\"\",\"[Select a field name]\",INDEX(FieldNames!$E:$E,MATCH(A619,FieldNames!$A:$A,0)))","v":"[Select a field name]"}]
[null,""]
["FullStudent Dropout Report","FullStudent Dropout Report"]
["Enrollment status",{"$f":"IF(A622=\"\",\"[Select a field name]\",INDEX(FieldNames!$E:$E,MATCH(A622,FieldNames!$A:$A,0)))","v":"Enrollment Status"},{"$f":"\"=Dropped out\"","v":"=Dropped out"}]
["Cohort",{"$f":"IF(A623=\"\",\"[Select a field name]\",INDEX(FieldNames!$E:$E,MATCH(A623,FieldNames!$A:$A,0)))","v":"Cohort"},{"$f":"\"=\"&IF(StudentRptCohort=\"All\",\"*\",StudentRptCohort)","v":"=*"}]
[null,{"$f":"IF(A624=\"\",\"[Select a field name]\",INDEX(FieldNames!$E:$E,MATCH(A624,FieldNames!$A:$A,0)))","v":"[Select a field name]"}]
[null,{"$f":"IF(A625=\"\",\"[Select a field name]\",INDEX(FieldNames!$E:$E,MATCH(A625,FieldNames!$A:$A,0)))","v":"[Select a field name]"}]
[null,{"$f":"IF(A626=\"\",\"[Select a field name]\",INDEX(FieldNames!$E:$E,MATCH(A626,FieldNames!$A:$A,0)))","v":"[Select a field name]"}]
[null,{"$f":"IF(A627=\"\",\"[Select a field name]\",INDEX(FieldNames!$E:$E,MATCH(A627,FieldNames!$A:$A,0)))","v":"[Select a field name]"}]
[null,{"$f":"IF(A628=\"\",\"[Select a field name]\",INDEX(FieldNames!$E:$E,MATCH(A628,FieldNames!$A:$A,0)))","v":"[Select a field name]"}]
[null,{"$f":"IF(A629=\"\",\"[Select a field name]\",INDEX(FieldNames!$E:$E,MATCH(A629,FieldNames!$A:$A,0)))","v":"[Select a field name]"}]
[null,{"$f":"IF(A630=\"\",\"[Select a field name]\",INDEX(FieldNames!$E:$E,MATCH(A630,FieldNames!$A:$A,0)))","v":"[Select a field name]"}]
[null,{"$f":"IF(A631=\"\",\"[Select a field name]\",INDEX(FieldNames!$E:$E,MATCH(A631,FieldNames!$A:$A,0)))","v":"[Select a field name]"}]
[null,""]
["GP1Student transfers","GP1Student transfers"]
["Enrollment status",{"$f":"IF(A634=\"\",\"[Select a field name]\",INDEX(FieldNames!$E:$E,MATCH(A634,FieldNames!$A:$A,0)))","v":"Enrollment Status"},{"$f":"\"=Transferred In\"","v":"=Transferred In"}]
["Cohort",{"$f":"IF(A635=\"\",\"[Select a field name]\",INDEX(FieldNames!$E:$E,MATCH(A635,FieldNames!$A:$A,0)))","v":"Cohort"},{"$f":"\"=\"&IF(StudentRptCohort=\"All\",\"*\",StudentRptCohort)","v":"=*"}]
[null,{"$f":"IF(A636=\"\",\"[Select a field name]\",INDEX(FieldNames!$E:$E,MATCH(A636,FieldNames!$A:$A,0)))","v":"[Select a field name]"}]
[null,{"$f":"IF(A637=\"\",\"[Select a field name]\",INDEX(FieldNames!$E:$E,MATCH(A637,FieldNames!$A:$A,0)))","v":"[Select a field name]"}]
[null,{"$f":"IF(A638=\"\",\"[Select a field name]\",INDEX(FieldNames!$E:$E,MATCH(A638,FieldNames!$A:$A,0)))","v":"[Select a field name]"}]
[null,{"$f":"IF(A639=\"\",\"[Select a field name]\",INDEX(FieldNames!$E:$E,MATCH(A639,FieldNames!$A:$A,0)))","v":"[Select a field name]"}]
[null,{"$f":"IF(A640=\"\",\"[Select a field name]\",INDEX(FieldNames!$E:$E,MATCH(A640,FieldNames!$A:$A,0)))","v":"[Select a field name]"}]
[null,{"$f":"IF(A641=\"\",\"[Select a field name]\",INDEX(FieldNames!$E:$E,MATCH(A641,FieldNames!$A:$A,0)))","v":"[Select a field name]"}]
[null,{"$f":"IF(A642=\"\",\"[Select a field name]\",INDEX(FieldNames!$E:$E,MATCH(A642,FieldNames!$A:$A,0)))","v":"[Select a field name]"}]
[null,{"$f":"IF(A643=\"\",\"[Select a field name]\",INDEX(FieldNames!$E:$E,MATCH(A643,FieldNames!$A:$A,0)))","v":"[Select a field name]"}]
[null,""]
["GP2Student transfers","GP2Student transfers"]
["Enrollment status",{"$f":"IF(A646=\"\",\"[Select a field name]\",INDEX(FieldNames!$E:$E,MATCH(A646,FieldNames!$A:$A,0)))","v":"Enrollment Status"},{"$f":"\"=Transferred In\"","v":"=Transferred In"}]
["Cohort",{"$f":"IF(A647=\"\",\"[Select a field name]\",INDEX(FieldNames!$E:$E,MATCH(A647,FieldNames!$A:$A,0)))","v":"Cohort"},{"$f":"\"=\"&IF(StudentRptCohort=\"All\",\"*\",StudentRptCohort)","v":"=*"}]
[null,{"$f":"IF(A648=\"\",\"[Select a field name]\",INDEX(FieldNames!$E:$E,MATCH(A648,FieldNames!$A:$A,0)))","v":"[Select a field name]"}]
[null,{"$f":"IF(A649=\"\",\"[Select a field name]\",INDEX(FieldNames!$E:$E,MATCH(A649,FieldNames!$A:$A,0)))","v":"[Select a field name]"}]
[null,{"$f":"IF(A650=\"\",\"[Select a field name]\",INDEX(FieldNames!$E:$E,MATCH(A650,FieldNames!$A:$A,0)))","v":"[Select a field name]"}]
[null,{"$f":"IF(A651=\"\",\"[Select a field name]\",INDEX(FieldNames!$E:$E,MATCH(A651,FieldNames!$A:$A,0)))","v":"[Select a field name]"}]
[null,{"$f":"IF(A652=\"\",\"[Select a field name]\",INDEX(FieldNames!$E:$E,MATCH(A652,FieldNames!$A:$A,0)))","v":"[Select a field name]"}]
[null,{"$f":"IF(A653=\"\",\"[Select a field name]\",INDEX(FieldNames!$E:$E,MATCH(A653,FieldNames!$A:$A,0)))","v":"[Select a field name]"}]
[null,{"$f":"IF(A654=\"\",\"[Select a field name]\",INDEX(FieldNames!$E:$E,MATCH(A654,FieldNames!$A:$A,0)))","v":"[Select a field name]"}]
[null,{"$f":"IF(A655=\"\",\"[Select a field name]\",INDEX(FieldNames!$E:$E,MATCH(A655,FieldNames!$A:$A,0)))","v":"[Select a field name]"}]
[null,""]
["GP3Student transfers","GP3Student transfers"]
["Enrollment status",{"$f":"IF(A658=\"\",\"[Select a field name]\",INDEX(FieldNames!$E:$E,MATCH(A658,FieldNames!$A:$A,0)))","v":"Enrollment Status"},{"$f":"\"=Transferred In\"","v":"=Transferred In"}]
["Cohort",{"$f":"IF(A659=\"\",\"[Select a field name]\",INDEX(FieldNames!$E:$E,MATCH(A659,FieldNames!$A:$A,0)))","v":"Cohort"},{"$f":"\"=\"&IF(StudentRptCohort=\"All\",\"*\",StudentRptCohort)","v":"=*"}]
[null,{"$f":"IF(A660=\"\",\"[Select a field name]\",INDEX(FieldNames!$E:$E,MATCH(A660,FieldNames!$A:$A,0)))","v":"[Select a field name]"}]
[null,{"$f":"IF(A661=\"\",\"[Select a field name]\",INDEX(FieldNames!$E:$E,MATCH(A661,FieldNames!$A:$A,0)))","v":"[Select a field name]"}]
[null,{"$f":"IF(A662=\"\",\"[Select a field name]\",INDEX(FieldNames!$E:$E,MATCH(A662,FieldNames!$A:$A,0)))","v":"[Select a field name]"}]
[null,{"$f":"IF(A663=\"\",\"[Select a field name]\",INDEX(FieldNames!$E:$E,MATCH(A663,FieldNames!$A:$A,0)))","v":"[Select a field name]"}]
[null,{"$f":"IF(A664=\"\",\"[Select a field name]\",INDEX(FieldNames!$E:$E,MATCH(A664,FieldNames!$A:$A,0)))","v":"[Select a field name]"}]
[null,{"$f":"IF(A665=\"\",\"[Select a field name]\",INDEX(FieldNames!$E:$E,MATCH(A665,FieldNames!$A:$A,0)))","v":"[Select a field name]"}]
[null,{"$f":"IF(A666=\"\",\"[Select a field name]\",INDEX(FieldNames!$E:$E,MATCH(A666,FieldNames!$A:$A,0)))","v":"[Select a field name]"}]
[null,{"$f":"IF(A667=\"\",\"[Select a field name]\",INDEX(FieldNames!$E:$E,MATCH(A667,FieldNames!$A:$A,0)))","v":"[Select a field name]"}]
[null,""]
["GP4Student transfers","GP4Student transfers"]
["Enrollment status",{"$f":"IF(A670=\"\",\"[Select a field name]\",INDEX(FieldNames!$E:$E,MATCH(A670,FieldNames!$A:$A,0)))","v":"Enrollment Status"},{"$f":"\"=Transferred In\"","v":"=Transferred In"}]
["Cohort",{"$f":"IF(A671=\"\",\"[Select a field name]\",INDEX(FieldNames!$E:$E,MATCH(A671,FieldNames!$A:$A,0)))","v":"Cohort"},{"$f":"\"=\"&IF(StudentRptCohort=\"All\",\"*\",StudentRptCohort)","v":"=*"}]
[null,{"$f":"IF(A672=\"\",\"[Select a field name]\",INDEX(FieldNames!$E:$E,MATCH(A672,FieldNames!$A:$A,0)))","v":"[Select a field name]"}]
[null,{"$f":"IF(A673=\"\",\"[Select a field name]\",INDEX(FieldNames!$E:$E,MATCH(A673,FieldNames!$A:$A,0)))","v":"[Select a field name]"}]
[null,{"$f":"IF(A674=\"\",\"[Select a field name]\",INDEX(FieldNames!$E:$E,MATCH(A674,FieldNames!$A:$A,0)))","v":"[Select a field name]"}]
[null,{"$f":"IF(A675=\"\",\"[Select a field name]\",INDEX(FieldNames!$E:$E,MATCH(A675,FieldNames!$A:$A,0)))","v":"[Select a field name]"}]
[null,{"$f":"IF(A676=\"\",\"[Select a field name]\",INDEX(FieldNames!$E:$E,MATCH(A676,FieldNames!$A:$A,0)))","v":"[Select a field name]"}]
[null,{"$f":"IF(A677=\"\",\"[Select a field name]\",INDEX(FieldNames!$E:$E,MATCH(A677,FieldNames!$A:$A,0)))","v":"[Select a field name]"}]
[null,{"$f":"IF(A678=\"\",\"[Select a field name]\",INDEX(FieldNames!$E:$E,MATCH(A678,FieldNames!$A:$A,0)))","v":"[Select a field name]"}]
[null,{"$f":"IF(A679=\"\",\"[Select a field name]\",INDEX(FieldNames!$E:$E,MATCH(A679,FieldNames!$A:$A,0)))","v":"[Select a field name]"}]
[null,""]
["yrStudent transfers","yrStudent transfers"]
["Enrollment status",{"$f":"IF(A682=\"\",\"[Select a field name]\",INDEX(FieldNames!$E:$E,MATCH(A682,FieldNames!$A:$A,0)))","v":"Enrollment Status"},{"$f":"\"=Transferred In\"","v":"=Transferred In"}]
["Cohort",{"$f":"IF(A683=\"\",\"[Select a field name]\",INDEX(FieldNames!$E:$E,MATCH(A683,FieldNames!$A:$A,0)))","v":"Cohort"},{"$f":"\"=\"&IF(StudentRptCohort=\"All\",\"*\",StudentRptCohort)","v":"=*"}]
[null,{"$f":"IF(A684=\"\",\"[Select a field name]\",INDEX(FieldNames!$E:$E,MATCH(A684,FieldNames!$A:$A,0)))","v":"[Select a field name]"}]
[null,{"$f":"IF(A685=\"\",\"[Select a field name]\",INDEX(FieldNames!$E:$E,MATCH(A685,FieldNames!$A:$A,0)))","v":"[Select a field name]"}]
[null,{"$f":"IF(A686=\"\",\"[Select a field name]\",INDEX(FieldNames!$E:$E,MATCH(A686,FieldNames!$A:$A,0)))","v":"[Select a field name]"}]
[null,{"$f":"IF(A687=\"\",\"[Select a field name]\",INDEX(FieldNames!$E:$E,MATCH(A687,FieldNames!$A:$A,0)))","v":"[Select a field name]"}]
[null,{"$f":"IF(A688=\"\",\"[Select a field name]\",INDEX(FieldNames!$E:$E,MATCH(A688,FieldNames!$A:$A,0)))","v":"[Select a field name]"}]
[null,{"$f":"IF(A689=\"\",\"[Select a field name]\",INDEX(FieldNames!$E:$E,MATCH(A689,FieldNames!$A:$A,0)))","v":"[Select a field name]"}]
[null,{"$f":"IF(A690=\"\",\"[Select a field name]\",INDEX(FieldNames!$E:$E,MATCH(A690,FieldNames!$A:$A,0)))","v":"[Select a field name]"}]
[null,{"$f":"IF(A691=\"\",\"[Select a field name]\",INDEX(FieldNames!$E:$E,MATCH(A691,FieldNames!$A:$A,0)))","v":"[Select a field name]"}]
[null,""]
["FullStudent transfers","FullStudent transfers"]
["Enrollment status",{"$f":"IF(A694=\"\",\"[Select a field name]\",INDEX(FieldNames!$E:$E,MATCH(A694,FieldNames!$A:$A,0)))","v":"Enrollment Status"},{"$f":"\"=Transferred In\"","v":"=Transferred In"}]
["Cohort",{"$f":"IF(A695=\"\",\"[Select a field name]\",INDEX(FieldNames!$E:$E,MATCH(A695,FieldNames!$A:$A,0)))","v":"Cohort"},{"$f":"\"=\"&IF(StudentRptCohort=\"All\",\"*\",StudentRptCohort)","v":"=*"}]
[null,{"$f":"IF(A696=\"\",\"[Select a field name]\",INDEX(FieldNames!$E:$E,MATCH(A696,FieldNames!$A:$A,0)))","v":"[Select a field name]"}]
[null,{"$f":"IF(A697=\"\",\"[Select a field name]\",INDEX(FieldNames!$E:$E,MATCH(A697,FieldNames!$A:$A,0)))","v":"[Select a field name]"}]
[null,{"$f":"IF(A698=\"\",\"[Select a field name]\",INDEX(FieldNames!$E:$E,MATCH(A698,FieldNames!$A:$A,0)))","v":"[Select a field name]"}]
[null,{"$f":"IF(A699=\"\",\"[Select a field name]\",INDEX(FieldNames!$E:$E,MATCH(A699,FieldNames!$A:$A,0)))","v":"[Select a field name]"}]
[null,{"$f":"IF(A700=\"\",\"[Select a field name]\",INDEX(FieldNames!$E:$E,MATCH(A700,FieldNames!$A:$A,0)))","v":"[Select a field name]"}]
[null,{"$f":"IF(A701=\"\",\"[Select a field name]\",INDEX(FieldNames!$E:$E,MATCH(A701,FieldNames!$A:$A,0)))","v":"[Select a field name]"}]
[null,{"$f":"IF(A702=\"\",\"[Select a field name]\",INDEX(FieldNames!$E:$E,MATCH(A702,FieldNames!$A:$A,0)))","v":"[Select a field name]"}]
[null,{"$f":"IF(A703=\"\",\"[Select a field name]\",INDEX(FieldNames!$E:$E,MATCH(A703,FieldNames!$A:$A,0)))","v":"[Select a field name]"}]
[null,""]
["GP1Incoming Indicator of Risk Transition Report","GP1Incoming Indicator of Risk Transition Report"]
["Pre-HS indicator",{"$f":"IF(A706=\"\",\"[Select a field name]\",INDEX(FieldNames!$E:$E,MATCH(A706,FieldNames!$A:$A,0)))","v":"Incoming Risk Indicator"},{"$f":"\"=1\"","v":"=1"}]
["Cohort",{"$f":"IF(A707=\"\",\"[Select a field name]\",INDEX(FieldNames!$E:$E,MATCH(A707,FieldNames!$A:$A,0)))","v":"Cohort"},{"$f":"\"=\"&IF(StudentRptCohort=\"All\",\"*\",StudentRptCohort)","v":"=*"}]
[null,{"$f":"IF(A708=\"\",\"[Select a field name]\",INDEX(FieldNames!$E:$E,MATCH(A708,FieldNames!$A:$A,0)))","v":"[Select a field name]"}]
[null,{"$f":"IF(A709=\"\",\"[Select a field name]\",INDEX(FieldNames!$E:$E,MATCH(A709,FieldNames!$A:$A,0)))","v":"[Select a field name]"}]
[null,{"$f":"IF(A710=\"\",\"[Select a field name]\",INDEX(FieldNames!$E:$E,MATCH(A710,FieldNames!$A:$A,0)))","v":"[Select a field name]"}]
[null,{"$f":"IF(A711=\"\",\"[Select a field name]\",INDEX(FieldNames!$E:$E,MATCH(A711,FieldNames!$A:$A,0)))","v":"[Select a field name]"}]
[null,{"$f":"IF(A712=\"\",\"[Select a field name]\",INDEX(FieldNames!$E:$E,MATCH(A712,FieldNames!$A:$A,0)))","v":"[Select a field name]"}]
[null,{"$f":"IF(A713=\"\",\"[Select a field name]\",INDEX(FieldNames!$E:$E,MATCH(A713,FieldNames!$A:$A,0)))","v":"[Select a field name]"}]
[null,{"$f":"IF(A714=\"\",\"[Select a field name]\",INDEX(FieldNames!$E:$E,MATCH(A714,FieldNames!$A:$A,0)))","v":"[Select a field name]"}]
[null,{"$f":"IF(A715=\"\",\"[Select a field name]\",INDEX(FieldNames!$E:$E,MATCH(A715,FieldNames!$A:$A,0)))","v":"[Select a field name]"}]
[null,""]
["GP2Incoming Indicator of Risk Transition Report","GP2Incoming Indicator of Risk Transition Report"]
["Pre-HS indicator",{"$f":"IF(A718=\"\",\"[Select a field name]\",INDEX(FieldNames!$E:$E,MATCH(A718,FieldNames!$A:$A,0)))","v":"Incoming Risk Indicator"},{"$f":"\"=1\"","v":"=1"}]
["Cohort",{"$f":"IF(A719=\"\",\"[Select a field name]\",INDEX(FieldNames!$E:$E,MATCH(A719,FieldNames!$A:$A,0)))","v":"Cohort"},{"$f":"\"=\"&IF(StudentRptCohort=\"All\",\"*\",StudentRptCohort)","v":"=*"}]
[null,{"$f":"IF(A720=\"\",\"[Select a field name]\",INDEX(FieldNames!$E:$E,MATCH(A720,FieldNames!$A:$A,0)))","v":"[Select a field name]"}]
[null,{"$f":"IF(A721=\"\",\"[Select a field name]\",INDEX(FieldNames!$E:$E,MATCH(A721,FieldNames!$A:$A,0)))","v":"[Select a field name]"}]
[null,{"$f":"IF(A722=\"\",\"[Select a field name]\",INDEX(FieldNames!$E:$E,MATCH(A722,FieldNames!$A:$A,0)))","v":"[Select a field name]"}]
[null,{"$f":"IF(A723=\"\",\"[Select a field name]\",INDEX(FieldNames!$E:$E,MATCH(A723,FieldNames!$A:$A,0)))","v":"[Select a field name]"}]
[null,{"$f":"IF(A724=\"\",\"[Select a field name]\",INDEX(FieldNames!$E:$E,MATCH(A724,FieldNames!$A:$A,0)))","v":"[Select a field name]"}]
[null,{"$f":"IF(A725=\"\",\"[Select a field name]\",INDEX(FieldNames!$E:$E,MATCH(A725,FieldNames!$A:$A,0)))","v":"[Select a field name]"}]
[null,{"$f":"IF(A726=\"\",\"[Select a field name]\",INDEX(FieldNames!$E:$E,MATCH(A726,FieldNames!$A:$A,0)))","v":"[Select a field name]"}]
[null,{"$f":"IF(A727=\"\",\"[Select a field name]\",INDEX(FieldNames!$E:$E,MATCH(A727,FieldNames!$A:$A,0)))","v":"[Select a field name]"}]
[null,""]
["GP3Incoming Indicator of Risk Transition Report","GP3Incoming Indicator of Risk Transition Report"]
["Pre-HS indicator",{"$f":"IF(A730=\"\",\"[Select a field name]\",INDEX(FieldNames!$E:$E,MATCH(A730,FieldNames!$A:$A,0)))","v":"Incoming Risk Indicator"},{"$f":"\"=1\"","v":"=1"}]
["Cohort",{"$f":"IF(A731=\"\",\"[Select a field name]\",INDEX(FieldNames!$E:$E,MATCH(A731,FieldNames!$A:$A,0)))","v":"Cohort"},{"$f":"\"=\"&IF(StudentRptCohort=\"All\",\"*\",StudentRptCohort)","v":"=*"}]
[null,{"$f":"IF(A732=\"\",\"[Select a field name]\",INDEX(FieldNames!$E:$E,MATCH(A732,FieldNames!$A:$A,0)))","v":"[Select a field name]"}]
[null,{"$f":"IF(A733=\"\",\"[Select a field name]\",INDEX(FieldNames!$E:$E,MATCH(A733,FieldNames!$A:$A,0)))","v":"[Select a field name]"}]
[null,{"$f":"IF(A734=\"\",\"[Select a field name]\",INDEX(FieldNames!$E:$E,MATCH(A734,FieldNames!$A:$A,0)))","v":"[Select a field name]"}]
[null,{"$f":"IF(A735=\"\",\"[Select a field name]\",INDEX(FieldNames!$E:$E,MATCH(A735,FieldNames!$A:$A,0)))","v":"[Select a field name]"}]
[null,{"$f":"IF(A736=\"\",\"[Select a field name]\",INDEX(FieldNames!$E:$E,MATCH(A736,FieldNames!$A:$A,0)))","v":"[Select a field name]"}]
[null,{"$f":"IF(A737=\"\",\"[Select a field name]\",INDEX(FieldNames!$E:$E,MATCH(A737,FieldNames!$A:$A,0)))","v":"[Select a field name]"}]
[null,{"$f":"IF(A738=\"\",\"[Select a field name]\",INDEX(FieldNames!$E:$E,MATCH(A738,FieldNames!$A:$A,0)))","v":"[Select a field name]"}]
[null,{"$f":"IF(A739=\"\",\"[Select a field name]\",INDEX(FieldNames!$E:$E,MATCH(A739,FieldNames!$A:$A,0)))","v":"[Select a field name]"}]
[null,""]
["GP4Incoming Indicator of Risk Transition Report","GP4Incoming Indicator of Risk Transition Report"]
["Pre-HS indicator",{"$f":"IF(A742=\"\",\"[Select a field name]\",INDEX(FieldNames!$E:$E,MATCH(A742,FieldNames!$A:$A,0)))","v":"Incoming Risk Indicator"},{"$f":"\"=1\"","v":"=1"}]
["Cohort",{"$f":"IF(A743=\"\",\"[Select a field name]\",INDEX(FieldNames!$E:$E,MATCH(A743,FieldNames!$A:$A,0)))","v":"Cohort"},{"$f":"\"=\"&IF(StudentRptCohort=\"All\",\"*\",StudentRptCohort)","v":"=*"}]
[null,{"$f":"IF(A744=\"\",\"[Select a field name]\",INDEX(FieldNames!$E:$E,MATCH(A744,FieldNames!$A:$A,0)))","v":"[Select a field name]"}]
[null,{"$f":"IF(A745=\"\",\"[Select a field name]\",INDEX(FieldNames!$E:$E,MATCH(A745,FieldNames!$A:$A,0)))","v":"[Select a field name]"}]
[null,{"$f":"IF(A746=\"\",\"[Select a field name]\",INDEX(FieldNames!$E:$E,MATCH(A746,FieldNames!$A:$A,0)))","v":"[Select a field name]"}]
[null,{"$f":"IF(A747=\"\",\"[Select a field name]\",INDEX(FieldNames!$E:$E,MATCH(A747,FieldNames!$A:$A,0)))","v":"[Select a field name]"}]
[null,{"$f":"IF(A748=\"\",\"[Select a field name]\",INDEX(FieldNames!$E:$E,MATCH(A748,FieldNames!$A:$A,0)))","v":"[Select a field name]"}]
[null,{"$f":"IF(A749=\"\",\"[Select a field name]\",INDEX(FieldNames!$E:$E,MATCH(A749,FieldNames!$A:$A,0)))","v":"[Select a field name]"}]
[null,{"$f":"IF(A750=\"\",\"[Select a field name]\",INDEX(FieldNames!$E:$E,MATCH(A750,FieldNames!$A:$A,0)))","v":"[Select a field name]"}]
[null,{"$f":"IF(A751=\"\",\"[Select a field name]\",INDEX(FieldNames!$E:$E,MATCH(A751,FieldNames!$A:$A,0)))","v":"[Select a field name]"}]
[null,""]
["yrIncoming Indicator of Risk Transition Report","yrIncoming Indicator of Risk Transition Report"]
["Pre-HS indicator",{"$f":"IF(A754=\"\",\"[Select a field name]\",INDEX(FieldNames!$E:$E,MATCH(A754,FieldNames!$A:$A,0)))","v":"Incoming Risk Indicator"},{"$f":"\"=1\"","v":"=1"}]
["Cohort",{"$f":"IF(A755=\"\",\"[Select a field name]\",INDEX(FieldNames!$E:$E,MATCH(A755,FieldNames!$A:$A,0)))","v":"Cohort"},{"$f":"\"=\"&IF(StudentRptCohort=\"All\",\"*\",StudentRptCohort)","v":"=*"}]
[null,{"$f":"IF(A756=\"\",\"[Select a field name]\",INDEX(FieldNames!$E:$E,MATCH(A756,FieldNames!$A:$A,0)))","v":"[Select a field name]"}]
[null,{"$f":"IF(A757=\"\",\"[Select a field name]\",INDEX(FieldNames!$E:$E,MATCH(A757,FieldNames!$A:$A,0)))","v":"[Select a field name]"}]
[null,{"$f":"IF(A758=\"\",\"[Select a field name]\",INDEX(FieldNames!$E:$E,MATCH(A758,FieldNames!$A:$A,0)))","v":"[Select a field name]"}]
[null,{"$f":"IF(A759=\"\",\"[Select a field name]\",INDEX(FieldNames!$E:$E,MATCH(A759,FieldNames!$A:$A,0)))","v":"[Select a field name]"}]
[null,{"$f":"IF(A760=\"\",\"[Select a field name]\",INDEX(FieldNames!$E:$E,MATCH(A760,FieldNames!$A:$A,0)))","v":"[Select a field name]"}]
[null,{"$f":"IF(A761=\"\",\"[Select a field name]\",INDEX(FieldNames!$E:$E,MATCH(A761,FieldNames!$A:$A,0)))","v":"[Select a field name]"}]
[null,{"$f":"IF(A762=\"\",\"[Select a field name]\",INDEX(FieldNames!$E:$E,MATCH(A762,FieldNames!$A:$A,0)))","v":"[Select a field name]"}]
[null,{"$f":"IF(A763=\"\",\"[Select a field name]\",INDEX(FieldNames!$E:$E,MATCH(A763,FieldNames!$A:$A,0)))","v":"[Select a field name]"}]
[null,""]
["FullIncoming Indicator of Risk Transition Report","FullIncoming Indicator of Risk Transition Report"]
["Pre-HS indicator",{"$f":"IF(A766=\"\",\"[Select a field name]\",INDEX(FieldNames!$E:$E,MATCH(A766,FieldNames!$A:$A,0)))","v":"Incoming Risk Indicator"},{"$f":"\"=1\"","v":"=1"}]
["Cohort",{"$f":"IF(A767=\"\",\"[Select a field name]\",INDEX(FieldNames!$E:$E,MATCH(A767,FieldNames!$A:$A,0)))","v":"Cohort"},{"$f":"\"=\"&IF(StudentRptCohort=\"All\",\"*\",StudentRptCohort)","v":"=*"}]
[null,{"$f":"IF(A768=\"\",\"[Select a field name]\",INDEX(FieldNames!$E:$E,MATCH(A768,FieldNames!$A:$A,0)))","v":"[Select a field name]"}]
[null,{"$f":"IF(A769=\"\",\"[Select a field name]\",INDEX(FieldNames!$E:$E,MATCH(A769,FieldNames!$A:$A,0)))","v":"[Select a field name]"}]
[null,{"$f":"IF(A770=\"\",\"[Select a field name]\",INDEX(FieldNames!$E:$E,MATCH(A770,FieldNames!$A:$A,0)))","v":"[Select a field name]"}]
[null,{"$f":"IF(A771=\"\",\"[Select a field name]\",INDEX(FieldNames!$E:$E,MATCH(A771,FieldNames!$A:$A,0)))","v":"[Select a field name]"}]
[null,{"$f":"IF(A772=\"\",\"[Select a field name]\",INDEX(FieldNames!$E:$E,MATCH(A772,FieldNames!$A:$A,0)))","v":"[Select a field name]"}]
[null,{"$f":"IF(A773=\"\",\"[Select a field name]\",INDEX(FieldNames!$E:$E,MATCH(A773,FieldNames!$A:$A,0)))","v":"[Select a field name]"}]
[null,{"$f":"IF(A774=\"\",\"[Select a field name]\",INDEX(FieldNames!$E:$E,MATCH(A774,FieldNames!$A:$A,0)))","v":"[Select a field name]"}]
[null,{"$f":"IF(A775=\"\",\"[Select a field name]\",INDEX(FieldNames!$E:$E,MATCH(A775,FieldNames!$A:$A,0)))","v":"[Select a field name]"}]
[null,""]
["GP1On- to Off-Track Report","GP1On- to Off-Track Report"]
["Pre-HS indicator",{"$f":"IF(A778=\"\",\"[Select a field name]\",INDEX(FieldNames!$E:$E,MATCH(A778,FieldNames!$A:$A,0)))","v":"Incoming Risk Indicator"},{"$f":"\"=0\"","v":"=0"}]
["GP1_Any flag",{"$f":"IF(A779=\"\",\"[Select a field name]\",INDEX(FieldNames!$E:$E,MATCH(A779,FieldNames!$A:$A,0)))","v":"Quarter 1 Any Flag"},{"$f":"\"=1\"","v":"=1"}]
["Cohort",{"$f":"IF(A780=\"\",\"[Select a field name]\",INDEX(FieldNames!$E:$E,MATCH(A780,FieldNames!$A:$A,0)))","v":"Cohort"},{"$f":"\"=\"&IF(StudentRptCohort=\"All\",\"*\",StudentRptCohort)","v":"=*"}]
[null,{"$f":"IF(A781=\"\",\"[Select a field name]\",INDEX(FieldNames!$E:$E,MATCH(A781,FieldNames!$A:$A,0)))","v":"[Select a field name]"}]
[null,{"$f":"IF(A782=\"\",\"[Select a field name]\",INDEX(FieldNames!$E:$E,MATCH(A782,FieldNames!$A:$A,0)))","v":"[Select a field name]"}]
[null,{"$f":"IF(A783=\"\",\"[Select a field name]\",INDEX(FieldNames!$E:$E,MATCH(A783,FieldNames!$A:$A,0)))","v":"[Select a field name]"}]
[null,{"$f":"IF(A784=\"\",\"[Select a field name]\",INDEX(FieldNames!$E:$E,MATCH(A784,FieldNames!$A:$A,0)))","v":"[Select a field name]"}]
[null,{"$f":"IF(A785=\"\",\"[Select a field name]\",INDEX(FieldNames!$E:$E,MATCH(A785,FieldNames!$A:$A,0)))","v":"[Select a field name]"}]
[null,{"$f":"IF(A786=\"\",\"[Select a field name]\",INDEX(FieldNames!$E:$E,MATCH(A786,FieldNames!$A:$A,0)))","v":"[Select a field name]"}]
[null,{"$f":"IF(A787=\"\",\"[Select a field name]\",INDEX(FieldNames!$E:$E,MATCH(A787,FieldNames!$A:$A,0)))","v":"[Select a field name]"}]
[null,""]
["GP2On- to Off-Track Report","GP2On- to Off-Track Report"]
["GP1_Any flag",{"$f":"IF(A790=\"\",\"[Select a field name]\",INDEX(FieldNames!$E:$E,MATCH(A790,FieldNames!$A:$A,0)))","v":"Quarter 1 Any Flag"},{"$f":"\"=0\"","v":"=0"}]
["GP2_Any flag",{"$f":"IF(A791=\"\",\"[Select a field name]\",INDEX(FieldNames!$E:$E,MATCH(A791,FieldNames!$A:$A,0)))","v":"Quarter 2 Any Flag"},{"$f":"\"=1\"","v":"=1"}]
["Cohort",{"$f":"IF(A792=\"\",\"[Select a field name]\",INDEX(FieldNames!$E:$E,MATCH(A792,FieldNames!$A:$A,0)))","v":"Cohort"},{"$f":"\"=\"&IF(StudentRptCohort=\"All\",\"*\",StudentRptCohort)","v":"=*"}]
[null,{"$f":"IF(A793=\"\",\"[Select a field name]\",INDEX(FieldNames!$E:$E,MATCH(A793,FieldNames!$A:$A,0)))","v":"[Select a field name]"}]
[null,{"$f":"IF(A794=\"\",\"[Select a field name]\",INDEX(FieldNames!$E:$E,MATCH(A794,FieldNames!$A:$A,0)))","v":"[Select a field name]"}]
[null,{"$f":"IF(A795=\"\",\"[Select a field name]\",INDEX(FieldNames!$E:$E,MATCH(A795,FieldNames!$A:$A,0)))","v":"[Select a field name]"}]
[null,{"$f":"IF(A796=\"\",\"[Select a field name]\",INDEX(FieldNames!$E:$E,MATCH(A796,FieldNames!$A:$A,0)))","v":"[Select a field name]"}]
[null,{"$f":"IF(A797=\"\",\"[Select a field name]\",INDEX(FieldNames!$E:$E,MATCH(A797,FieldNames!$A:$A,0)))","v":"[Select a field name]"}]
[null,{"$f":"IF(A798=\"\",\"[Select a field name]\",INDEX(FieldNames!$E:$E,MATCH(A798,FieldNames!$A:$A,0)))","v":"[Select a field name]"}]
[null,{"$f":"IF(A799=\"\",\"[Select a field name]\",INDEX(FieldNames!$E:$E,MATCH(A799,FieldNames!$A:$A,0)))","v":"[Select a field name]"}]
[null,""]
["GP3On- to Off-Track Report","GP3On- to Off-Track Report"]
["GP2_Any flag",{"$f":"IF(A802=\"\",\"[Select a field name]\",INDEX(FieldNames!$E:$E,MATCH(A802,FieldNames!$A:$A,0)))","v":"Quarter 2 Any Flag"},{"$f":"\"=0\"","v":"=0"}]
["GP3_Any flag",{"$f":"IF(A803=\"\",\"[Select a field name]\",INDEX(FieldNames!$E:$E,MATCH(A803,FieldNames!$A:$A,0)))","v":"Quarter 3 Any Flag"},{"$f":"\"=1\"","v":"=1"}]
["Cohort",{"$f":"IF(A804=\"\",\"[Select a field name]\",INDEX(FieldNames!$E:$E,MATCH(A804,FieldNames!$A:$A,0)))","v":"Cohort"},{"$f":"\"=\"&IF(StudentRptCohort=\"All\",\"*\",StudentRptCohort)","v":"=*"}]
[null,{"$f":"IF(A805=\"\",\"[Select a field name]\",INDEX(FieldNames!$E:$E,MATCH(A805,FieldNames!$A:$A,0)))","v":"[Select a field name]"}]
[null,{"$f":"IF(A806=\"\",\"[Select a field name]\",INDEX(FieldNames!$E:$E,MATCH(A806,FieldNames!$A:$A,0)))","v":"[Select a field name]"}]
[null,{"$f":"IF(A807=\"\",\"[Select a field name]\",INDEX(FieldNames!$E:$E,MATCH(A807,FieldNames!$A:$A,0)))","v":"[Select a field name]"}]
[null,{"$f":"IF(A808=\"\",\"[Select a field name]\",INDEX(FieldNames!$E:$E,MATCH(A808,FieldNames!$A:$A,0)))","v":"[Select a field name]"}]
[null,{"$f":"IF(A809=\"\",\"[Select a field name]\",INDEX(FieldNames!$E:$E,MATCH(A809,FieldNames!$A:$A,0)))","v":"[Select a field name]"}]
[null,{"$f":"IF(A810=\"\",\"[Select a field name]\",INDEX(FieldNames!$E:$E,MATCH(A810,FieldNames!$A:$A,0)))","v":"[Select a field name]"}]
[null,{"$f":"IF(A811=\"\",\"[Select a field name]\",INDEX(FieldNames!$E:$E,MATCH(A811,FieldNames!$A:$A,0)))","v":"[Select a field name]"}]
[null,""]
["GP4On- to Off-Track Report","GP4On- to Off-Track Report"]
["GP3_Any flag",{"$f":"IF(A814=\"\",\"[Select a field name]\",INDEX(FieldNames!$E:$E,MATCH(A814,FieldNames!$A:$A,0)))","v":"Quarter 3 Any Flag"},{"$f":"\"=0\"","v":"=0"}]
["GP4_Any flag",{"$f":"IF(A815=\"\",\"[Select a field name]\",INDEX(FieldNames!$E:$E,MATCH(A815,FieldNames!$A:$A,0)))","v":"Quarter 4 Any Flag"},{"$f":"\"=1\"","v":"=1"}]
["Cohort",{"$f":"IF(A816=\"\",\"[Select a field name]\",INDEX(FieldNames!$E:$E,MATCH(A816,FieldNames!$A:$A,0)))","v":"Cohort"},{"$f":"\"=\"&IF(StudentRptCohort=\"All\",\"*\",StudentRptCohort)","v":"=*"}]
[null,{"$f":"IF(A817=\"\",\"[Select a field name]\",INDEX(FieldNames!$E:$E,MATCH(A817,FieldNames!$A:$A,0)))","v":"[Select a field name]"}]
[null,{"$f":"IF(A818=\"\",\"[Select a field name]\",INDEX(FieldNames!$E:$E,MATCH(A818,FieldNames!$A:$A,0)))","v":"[Select a field name]"}]
[null,{"$f":"IF(A819=\"\",\"[Select a field name]\",INDEX(FieldNames!$E:$E,MATCH(A819,FieldNames!$A:$A,0)))","v":"[Select a field name]"}]
[null,{"$f":"IF(A820=\"\",\"[Select a field name]\",INDEX(FieldNames!$E:$E,MATCH(A820,FieldNames!$A:$A,0)))","v":"[Select a field name]"}]
[null,{"$f":"IF(A821=\"\",\"[Select a field name]\",INDEX(FieldNames!$E:$E,MATCH(A821,FieldNames!$A:$A,0)))","v":"[Select a field name]"}]
[null,{"$f":"IF(A822=\"\",\"[Select a field name]\",INDEX(FieldNames!$E:$E,MATCH(A822,FieldNames!$A:$A,0)))","v":"[Select a field name]"}]
[null,{"$f":"IF(A823=\"\",\"[Select a field name]\",INDEX(FieldNames!$E:$E,MATCH(A823,FieldNames!$A:$A,0)))","v":"[Select a field name]"}]
[null,""]
["yrOn- to Off-Track Report","yrOn- to Off-Track Report"]
[{"$f":"\"GP\"&5-GP_Type&\"_Any flag\"","v":"GP4_Any flag"},{"$f":"IF(A826=\"\",\"[Select a field name]\",INDEX(FieldNames!$E:$E,MATCH(A826,FieldNames!$A:$A,0)))","v":"Quarter 4 Any Flag"},{"$f":"\"=0\"","v":"=0"}]
["eoy_Any flag",{"$f":"IF(A827=\"\",\"[Select a field name]\",INDEX(FieldNames!$E:$E,MATCH(A827,FieldNames!$A:$A,0)))","v":"End of Year Any Flag"},{"$f":"\"=1\"","v":"=1"}]
["Cohort",{"$f":"IF(A828=\"\",\"[Select a field name]\",INDEX(FieldNames!$E:$E,MATCH(A828,FieldNames!$A:$A,0)))","v":"Cohort"},{"$f":"\"=\"&IF(StudentRptCohort=\"All\",\"*\",StudentRptCohort)","v":"=*"}]
[null,{"$f":"IF(A829=\"\",\"[Select a field name]\",INDEX(FieldNames!$E:$E,MATCH(A829,FieldNames!$A:$A,0)))","v":"[Select a field name]"}]
[null,{"$f":"IF(A830=\"\",\"[Select a field name]\",INDEX(FieldNames!$E:$E,MATCH(A830,FieldNames!$A:$A,0)))","v":"[Select a field name]"}]
[null,{"$f":"IF(A831=\"\",\"[Select a field name]\",INDEX(FieldNames!$E:$E,MATCH(A831,FieldNames!$A:$A,0)))","v":"[Select a field name]"}]
[null,{"$f":"IF(A832=\"\",\"[Select a field name]\",INDEX(FieldNames!$E:$E,MATCH(A832,FieldNames!$A:$A,0)))","v":"[Select a field name]"}]
[null,{"$f":"IF(A833=\"\",\"[Select a field name]\",INDEX(FieldNames!$E:$E,MATCH(A833,FieldNames!$A:$A,0)))","v":"[Select a field name]"}]
[null,{"$f":"IF(A834=\"\",\"[Select a field name]\",INDEX(FieldNames!$E:$E,MATCH(A834,FieldNames!$A:$A,0)))","v":"[Select a field name]"}]
[null,{"$f":"IF(A835=\"\",\"[Select a field name]\",INDEX(FieldNames!$E:$E,MATCH(A835,FieldNames!$A:$A,0)))","v":"[Select a field name]"}]
[null,""]
["FullOn- to Off-Track Report","FullOn- to Off-Track Report"]
["Pre-HS indicator",{"$f":"IF(A838=\"\",\"[Select a field name]\",INDEX(FieldNames!$E:$E,MATCH(A838,FieldNames!$A:$A,0)))","v":"Incoming Risk Indicator"},{"$f":"\"=0\"","v":"=0"}]
["GP1_Any flag",{"$f":"IF(A839=\"\",\"[Select a field name]\",INDEX(FieldNames!$E:$E,MATCH(A839,FieldNames!$A:$A,0)))","v":"Quarter 1 Any Flag"},null,{"$f":"\"=0\"","v":"=0"}]
["GP2_Any flag",{"$f":"IF(A840=\"\",\"[Select a field name]\",INDEX(FieldNames!$E:$E,MATCH(A840,FieldNames!$A:$A,0)))","v":"Quarter 2 Any Flag"},null,null,{"$f":"\"=0\"","v":"=0"}]
[{"$f":"IF(GP_Type>2,\"\",\"GP3_Any flag\")","v":"GP3_Any flag"},{"$f":"IF(A841=\"\",\"[Select a field name]\",INDEX(FieldNames!$E:$E,MATCH(A841,FieldNames!$A:$A,0)))","v":"Quarter 3 Any Flag"},null,null,null,{"$f":"\"=0\"","v":"=0"}]
[{"$f":"IF(GP_Type>1,\"\",\"GP4_Any flag\")","v":"GP4_Any flag"},{"$f":"IF(A842=\"\",\"[Select a field name]\",INDEX(FieldNames!$E:$E,MATCH(A842,FieldNames!$A:$A,0)))","v":"Quarter 4 Any Flag"},null,null,null,null,{"$f":"\"=0\"","v":"=0"}]
["eoy_Any flag",{"$f":"IF(A843=\"\",\"[Select a field name]\",INDEX(FieldNames!$E:$E,MATCH(A843,FieldNames!$A:$A,0)))","v":"End of Year Any Flag"},{"$f":"\"=1\"","v":"=1"},{"$f":"\"=1\"","v":"=1"},{"$f":"\"=1\"","v":"=1"},{"$f":"\"=1\"","v":"=1"},{"$f":"\"=1\"","v":"=1"}]
["Cohort",{"$f":"IF(A844=\"\",\"[Select a field name]\",INDEX(FieldNames!$E:$E,MATCH(A844,FieldNames!$A:$A,0)))","v":"Cohort"},{"$f":"\"=\"&IF(StudentRptCohort=\"All\",\"*\",StudentRptCohort)","v":"=*"},{"$f":"\"=\"&IF(StudentRptCohort=\"All\",\"*\",StudentRptCohort)","v":"=*"},{"$f":"\"=\"&IF(StudentRptCohort=\"All\",\"*\",StudentRptCohort)","v":"=*"},{"$f":"\"=\"&IF(StudentRptCohort=\"All\",\"*\",StudentRptCohort)","v":"=*"},{"$f":"\"=\"&IF(StudentRptCohort=\"All\",\"*\",StudentRptCohort)","v":"=*"}]
[null,{"$f":"IF(A845=\"\",\"[Select a field name]\",INDEX(FieldNames!$E:$E,MATCH(A845,FieldNames!$A:$A,0)))","v":"[Select a field name]"}]
[null,{"$f":"IF(A846=\"\",\"[Select a field name]\",INDEX(FieldNames!$E:$E,MATCH(A846,FieldNames!$A:$A,0)))","v":"[Select a field name]"}]
[null,{"$f":"IF(A847=\"\",\"[Select a field name]\",INDEX(FieldNames!$E:$E,MATCH(A847,FieldNames!$A:$A,0)))","v":"[Select a field name]"}]
[null,""]
["GP1Off- to On-Track Report","GP1Off- to On-Track Report"]
["Pre-HS indicator",{"$f":"IF(A850=\"\",\"[Select a field name]\",INDEX(FieldNames!$E:$E,MATCH(A850,FieldNames!$A:$A,0)))","v":"Incoming Risk Indicator"},{"$f":"\"=1\"","v":"=1"}]
["GP1_Any flag",{"$f":"IF(A851=\"\",\"[Select a field name]\",INDEX(FieldNames!$E:$E,MATCH(A851,FieldNames!$A:$A,0)))","v":"Quarter 1 Any Flag"},{"$f":"\"=0\"","v":"=0"}]
["Cohort",{"$f":"IF(A852=\"\",\"[Select a field name]\",INDEX(FieldNames!$E:$E,MATCH(A852,FieldNames!$A:$A,0)))","v":"Cohort"},{"$f":"\"=\"&IF(StudentRptCohort=\"All\",\"*\",StudentRptCohort)","v":"=*"}]
[null,{"$f":"IF(A853=\"\",\"[Select a field name]\",INDEX(FieldNames!$E:$E,MATCH(A853,FieldNames!$A:$A,0)))","v":"[Select a field name]"}]
[null,{"$f":"IF(A854=\"\",\"[Select a field name]\",INDEX(FieldNames!$E:$E,MATCH(A854,FieldNames!$A:$A,0)))","v":"[Select a field name]"}]
[null,{"$f":"IF(A855=\"\",\"[Select a field name]\",INDEX(FieldNames!$E:$E,MATCH(A855,FieldNames!$A:$A,0)))","v":"[Select a field name]"}]
[null,{"$f":"IF(A856=\"\",\"[Select a field name]\",INDEX(FieldNames!$E:$E,MATCH(A856,FieldNames!$A:$A,0)))","v":"[Select a field name]"}]
[null,{"$f":"IF(A857=\"\",\"[Select a field name]\",INDEX(FieldNames!$E:$E,MATCH(A857,FieldNames!$A:$A,0)))","v":"[Select a field name]"}]
[null,{"$f":"IF(A858=\"\",\"[Select a field name]\",INDEX(FieldNames!$E:$E,MATCH(A858,FieldNames!$A:$A,0)))","v":"[Select a field name]"}]
[null,{"$f":"IF(A859=\"\",\"[Select a field name]\",INDEX(FieldNames!$E:$E,MATCH(A859,FieldNames!$A:$A,0)))","v":"[Select a field name]"}]
[null,""]
["GP2Off- to On-Track Report","GP2Off- to On-Track Report"]
["GP1_Any flag",{"$f":"IF(A862=\"\",\"[Select a field name]\",INDEX(FieldNames!$E:$E,MATCH(A862,FieldNames!$A:$A,0)))","v":"Quarter 1 Any Flag"},{"$f":"\"=1\"","v":"=1"}]
["GP2_Any flag",{"$f":"IF(A863=\"\",\"[Select a field name]\",INDEX(FieldNames!$E:$E,MATCH(A863,FieldNames!$A:$A,0)))","v":"Quarter 2 Any Flag"},{"$f":"\"=0\"","v":"=0"}]
["Cohort",{"$f":"IF(A864=\"\",\"[Select a field name]\",INDEX(FieldNames!$E:$E,MATCH(A864,FieldNames!$A:$A,0)))","v":"Cohort"},{"$f":"\"=\"&IF(StudentRptCohort=\"All\",\"*\",StudentRptCohort)","v":"=*"}]
[null,{"$f":"IF(A865=\"\",\"[Select a field name]\",INDEX(FieldNames!$E:$E,MATCH(A865,FieldNames!$A:$A,0)))","v":"[Select a field name]"}]
[null,{"$f":"IF(A866=\"\",\"[Select a field name]\",INDEX(FieldNames!$E:$E,MATCH(A866,FieldNames!$A:$A,0)))","v":"[Select a field name]"}]
[null,{"$f":"IF(A867=\"\",\"[Select a field name]\",INDEX(FieldNames!$E:$E,MATCH(A867,FieldNames!$A:$A,0)))","v":"[Select a field name]"}]
[null,{"$f":"IF(A868=\"\",\"[Select a field name]\",INDEX(FieldNames!$E:$E,MATCH(A868,FieldNames!$A:$A,0)))","v":"[Select a field name]"}]
[null,{"$f":"IF(A869=\"\",\"[Select a field name]\",INDEX(FieldNames!$E:$E,MATCH(A869,FieldNames!$A:$A,0)))","v":"[Select a field name]"}]
[null,{"$f":"IF(A870=\"\",\"[Select a field name]\",INDEX(FieldNames!$E:$E,MATCH(A870,FieldNames!$A:$A,0)))","v":"[Select a field name]"}]
[null,{"$f":"IF(A871=\"\",\"[Select a field name]\",INDEX(FieldNames!$E:$E,MATCH(A871,FieldNames!$A:$A,0)))","v":"[Select a field name]"}]
[null,""]
["GP3Off- to On-Track Report","GP3Off- to On-Track Report"]
["GP2_Any flag",{"$f":"IF(A874=\"\",\"[Select a field name]\",INDEX(FieldNames!$E:$E,MATCH(A874,FieldNames!$A:$A,0)))","v":"Quarter 2 Any Flag"},{"$f":"\"=1\"","v":"=1"}]
["GP3_Any flag",{"$f":"IF(A875=\"\",\"[Select a field name]\",INDEX(FieldNames!$E:$E,MATCH(A875,FieldNames!$A:$A,0)))","v":"Quarter 3 Any Flag"},{"$f":"\"=0\"","v":"=0"}]
["Cohort",{"$f":"IF(A876=\"\",\"[Select a field name]\",INDEX(FieldNames!$E:$E,MATCH(A876,FieldNames!$A:$A,0)))","v":"Cohort"},{"$f":"\"=\"&IF(StudentRptCohort=\"All\",\"*\",StudentRptCohort)","v":"=*"}]
[null,{"$f":"IF(A877=\"\",\"[Select a field name]\",INDEX(FieldNames!$E:$E,MATCH(A877,FieldNames!$A:$A,0)))","v":"[Select a field name]"}]
[null,{"$f":"IF(A878=\"\",\"[Select a field name]\",INDEX(FieldNames!$E:$E,MATCH(A878,FieldNames!$A:$A,0)))","v":"[Select a field name]"}]
[null,{"$f":"IF(A879=\"\",\"[Select a field name]\",INDEX(FieldNames!$E:$E,MATCH(A879,FieldNames!$A:$A,0)))","v":"[Select a field name]"}]
[null,{"$f":"IF(A880=\"\",\"[Select a field name]\",INDEX(FieldNames!$E:$E,MATCH(A880,FieldNames!$A:$A,0)))","v":"[Select a field name]"}]
[null,{"$f":"IF(A881=\"\",\"[Select a field name]\",INDEX(FieldNames!$E:$E,MATCH(A881,FieldNames!$A:$A,0)))","v":"[Select a field name]"}]
[null,{"$f":"IF(A882=\"\",\"[Select a field name]\",INDEX(FieldNames!$E:$E,MATCH(A882,FieldNames!$A:$A,0)))","v":"[Select a field name]"}]
[null,{"$f":"IF(A883=\"\",\"[Select a field name]\",INDEX(FieldNames!$E:$E,MATCH(A883,FieldNames!$A:$A,0)))","v":"[Select a field name]"}]
[null,""]
["GP4Off- to On-Track Report","GP4Off- to On-Track Report"]
["GP3_Any flag",{"$f":"IF(A886=\"\",\"[Select a field name]\",INDEX(FieldNames!$E:$E,MATCH(A886,FieldNames!$A:$A,0)))","v":"Quarter 3 Any Flag"},{"$f":"\"=1\"","v":"=1"}]
["GP4_Any flag",{"$f":"IF(A887=\"\",\"[Select a field name]\",INDEX(FieldNames!$E:$E,MATCH(A887,FieldNames!$A:$A,0)))","v":"Quarter 4 Any Flag"},{"$f":"\"=0\"","v":"=0"}]
["Cohort",{"$f":"IF(A888=\"\",\"[Select a field name]\",INDEX(FieldNames!$E:$E,MATCH(A888,FieldNames!$A:$A,0)))","v":"Cohort"},{"$f":"\"=\"&IF(StudentRptCohort=\"All\",\"*\",StudentRptCohort)","v":"=*"}]
[null,{"$f":"IF(A889=\"\",\"[Select a field name]\",INDEX(FieldNames!$E:$E,MATCH(A889,FieldNames!$A:$A,0)))","v":"[Select a field name]"}]
[null,{"$f":"IF(A890=\"\",\"[Select a field name]\",INDEX(FieldNames!$E:$E,MATCH(A890,FieldNames!$A:$A,0)))","v":"[Select a field name]"}]
[null,{"$f":"IF(A891=\"\",\"[Select a field name]\",INDEX(FieldNames!$E:$E,MATCH(A891,FieldNames!$A:$A,0)))","v":"[Select a field name]"}]
[null,{"$f":"IF(A892=\"\",\"[Select a field name]\",INDEX(FieldNames!$E:$E,MATCH(A892,FieldNames!$A:$A,0)))","v":"[Select a field name]"}]
[null,{"$f":"IF(A893=\"\",\"[Select a field name]\",INDEX(FieldNames!$E:$E,MATCH(A893,FieldNames!$A:$A,0)))","v":"[Select a field name]"}]
[null,{"$f":"IF(A894=\"\",\"[Select a field name]\",INDEX(FieldNames!$E:$E,MATCH(A894,FieldNames!$A:$A,0)))","v":"[Select a field name]"}]
[null,{"$f":"IF(A895=\"\",\"[Select a field name]\",INDEX(FieldNames!$E:$E,MATCH(A895,FieldNames!$A:$A,0)))","v":"[Select a field name]"}]
[null,""]
["yrOff- to On-Track Report","yrOff- to On-Track Report"]
[{"$f":"\"GP\"&5-GP_Type&\"_Any flag\"","v":"GP4_Any flag"},{"$f":"IF(A898=\"\",\"[Select a field name]\",INDEX(FieldNames!$E:$E,MATCH(A898,FieldNames!$A:$A,0)))","v":"Quarter 4 Any Flag"},{"$f":"\"=1\"","v":"=1"}]
["eoy_Any flag",{"$f":"IF(A899=\"\",\"[Select a field name]\",INDEX(FieldNames!$E:$E,MATCH(A899,FieldNames!$A:$A,0)))","v":"End of Year Any Flag"},{"$f":"\"=0\"","v":"=0"}]
["Cohort",{"$f":"IF(A900=\"\",\"[Select a field name]\",INDEX(FieldNames!$E:$E,MATCH(A900,FieldNames!$A:$A,0)))","v":"Cohort"},{"$f":"\"=\"&IF(StudentRptCohort=\"All\",\"*\",StudentRptCohort)","v":"=*"}]
[null,{"$f":"IF(A901=\"\",\"[Select a field name]\",INDEX(FieldNames!$E:$E,MATCH(A901,FieldNames!$A:$A,0)))","v":"[Select a field name]"}]
[null,{"$f":"IF(A902=\"\",\"[Select a field name]\",INDEX(FieldNames!$E:$E,MATCH(A902,FieldNames!$A:$A,0)))","v":"[Select a field name]"}]
[null,{"$f":"IF(A903=\"\",\"[Select a field name]\",INDEX(FieldNames!$E:$E,MATCH(A903,FieldNames!$A:$A,0)))","v":"[Select a field name]"}]
[null,{"$f":"IF(A904=\"\",\"[Select a field name]\",INDEX(FieldNames!$E:$E,MATCH(A904,FieldNames!$A:$A,0)))","v":"[Select a field name]"}]
[null,{"$f":"IF(A905=\"\",\"[Select a field name]\",INDEX(FieldNames!$E:$E,MATCH(A905,FieldNames!$A:$A,0)))","v":"[Select a field name]"}]
[null,{"$f":"IF(A906=\"\",\"[Select a field name]\",INDEX(FieldNames!$E:$E,MATCH(A906,FieldNames!$A:$A,0)))","v":"[Select a field name]"}]
[null,{"$f":"IF(A907=\"\",\"[Select a field name]\",INDEX(FieldNames!$E:$E,MATCH(A907,FieldNames!$A:$A,0)))","v":"[Select a field name]"}]
[null,""]
["FullOff- to On-Track Report","FullOff- to On-Track Report"]
["Pre-HS indicator",{"$f":"IF(A910=\"\",\"[Select a field name]\",INDEX(FieldNames!$E:$E,MATCH(A910,FieldNames!$A:$A,0)))","v":"Incoming Risk Indicator"},{"$f":"\"=1\"","v":"=1"}]
["GP1_Any flag",{"$f":"IF(A911=\"\",\"[Select a field name]\",INDEX(FieldNames!$E:$E,MATCH(A911,FieldNames!$A:$A,0)))","v":"Quarter 1 Any Flag"},null,{"$f":"\"=1\"","v":"=1"}]
["GP2_Any flag",{"$f":"IF(A912=\"\",\"[Select a field name]\",INDEX(FieldNames!$E:$E,MATCH(A912,FieldNames!$A:$A,0)))","v":"Quarter 2 Any Flag"},null,null,{"$f":"\"=1\"","v":"=1"}]
[{"$f":"IF(GP_Type>2,\"\",\"GP3_Any flag\")","v":"GP3_Any flag"},{"$f":"IF(A913=\"\",\"[Select a field name]\",INDEX(FieldNames!$E:$E,MATCH(A913,FieldNames!$A:$A,0)))","v":"Quarter 3 Any Flag"},null,null,null,{"$f":"\"=1\"","v":"=1"}]
[{"$f":"IF(GP_Type>1,\"\",\"GP4_Any flag\")","v":"GP4_Any flag"},{"$f":"IF(A914=\"\",\"[Select a field name]\",INDEX(FieldNames!$E:$E,MATCH(A914,FieldNames!$A:$A,0)))","v":"Quarter 4 Any Flag"},null,null,null,null,{"$f":"\"=1\"","v":"=1"}]
["eoy_Any flag",{"$f":"IF(A915=\"\",\"[Select a field name]\",INDEX(FieldNames!$E:$E,MATCH(A915,FieldNames!$A:$A,0)))","v":"End of Year Any Flag"},{"$f":"\"=0\"","v":"=0"},{"$f":"\"=0\"","v":"=0"},{"$f":"\"=0\"","v":"=0"},{"$f":"\"=0\"","v":"=0"},{"$f":"\"=0\"","v":"=0"}]
["Cohort",{"$f":"IF(A916=\"\",\"[Select a field name]\",INDEX(FieldNames!$E:$E,MATCH(A916,FieldNames!$A:$A,0)))","v":"Cohort"},{"$f":"\"=\"&IF(StudentRptCohort=\"All\",\"*\",StudentRptCohort)","v":"=*"},{"$f":"\"=\"&IF(StudentRptCohort=\"All\",\"*\",StudentRptCohort)","v":"=*"},{"$f":"\"=\"&IF(StudentRptCohort=\"All\",\"*\",StudentRptCohort)","v":"=*"},{"$f":"\"=\"&IF(StudentRptCohort=\"All\",\"*\",StudentRptCohort)","v":"=*"},{"$f":"\"=\"&IF(StudentRptCohort=\"All\",\"*\",StudentRptCohort)","v":"=*"}]
[null,{"$f":"IF(A917=\"\",\"[Select a field name]\",INDEX(FieldNames!$E:$E,MATCH(A917,FieldNames!$A:$A,0)))","v":"[Select a field name]"}]
[null,{"$f":"IF(A918=\"\",\"[Select a field name]\",INDEX(FieldNames!$E:$E,MATCH(A918,FieldNames!$A:$A,0)))","v":"[Select a field name]"}]
[null,{"$f":"IF(A919=\"\",\"[Select a field name]\",INDEX(FieldNames!$E:$E,MATCH(A919,FieldNames!$A:$A,0)))","v":"[Select a field name]"}]
[null,""]
["GP1Pre-HS On- to Off-Track Report","GP1Pre-HS On- to Off-Track Report"]
["Pre-HS indicator",{"$f":"IF(A922=\"\",\"[Select a field name]\",INDEX(FieldNames!$E:$E,MATCH(A922,FieldNames!$A:$A,0)))","v":"Incoming Risk Indicator"},{"$f":"\"=0\"","v":"=0"}]
["GP1_Any flag",{"$f":"IF(A923=\"\",\"[Select a field name]\",INDEX(FieldNames!$E:$E,MATCH(A923,FieldNames!$A:$A,0)))","v":"Quarter 1 Any Flag"},{"$f":"\"=1\"","v":"=1"}]
["Cohort",{"$f":"IF(A924=\"\",\"[Select a field name]\",INDEX(FieldNames!$E:$E,MATCH(A924,FieldNames!$A:$A,0)))","v":"Cohort"},{"$f":"\"=\"&IF(StudentRptCohort=\"All\",\"*\",StudentRptCohort)","v":"=*"}]
[null,{"$f":"IF(A925=\"\",\"[Select a field name]\",INDEX(FieldNames!$E:$E,MATCH(A925,FieldNames!$A:$A,0)))","v":"[Select a field name]"}]
[null,{"$f":"IF(A926=\"\",\"[Select a field name]\",INDEX(FieldNames!$E:$E,MATCH(A926,FieldNames!$A:$A,0)))","v":"[Select a field name]"}]
[null,{"$f":"IF(A927=\"\",\"[Select a field name]\",INDEX(FieldNames!$E:$E,MATCH(A927,FieldNames!$A:$A,0)))","v":"[Select a field name]"}]
[null,{"$f":"IF(A928=\"\",\"[Select a field name]\",INDEX(FieldNames!$E:$E,MATCH(A928,FieldNames!$A:$A,0)))","v":"[Select a field name]"}]
[null,{"$f":"IF(A929=\"\",\"[Select a field name]\",INDEX(FieldNames!$E:$E,MATCH(A929,FieldNames!$A:$A,0)))","v":"[Select a field name]"}]
[null,{"$f":"IF(A930=\"\",\"[Select a field name]\",INDEX(FieldNames!$E:$E,MATCH(A930,FieldNames!$A:$A,0)))","v":"[Select a field name]"}]
[null,{"$f":"IF(A931=\"\",\"[Select a field name]\",INDEX(FieldNames!$E:$E,MATCH(A931,FieldNames!$A:$A,0)))","v":"[Select a field name]"}]
[null,""]
["GP2Pre-HS On- to Off-Track Report","GP2Pre-HS On- to Off-Track Report"]
["Pre-HS Indicator",{"$f":"IF(A934=\"\",\"[Select a field name]\",INDEX(FieldNames!$E:$E,MATCH(A934,FieldNames!$A:$A,0)))","v":"Incoming Risk Indicator"},{"$f":"\"=0\"","v":"=0"}]
["GP2_Any flag",{"$f":"IF(A935=\"\",\"[Select a field name]\",INDEX(FieldNames!$E:$E,MATCH(A935,FieldNames!$A:$A,0)))","v":"Quarter 2 Any Flag"},{"$f":"\"=1\"","v":"=1"}]
["Cohort",{"$f":"IF(A936=\"\",\"[Select a field name]\",INDEX(FieldNames!$E:$E,MATCH(A936,FieldNames!$A:$A,0)))","v":"Cohort"},{"$f":"\"=\"&IF(StudentRptCohort=\"All\",\"*\",StudentRptCohort)","v":"=*"}]
[null,{"$f":"IF(A937=\"\",\"[Select a field name]\",INDEX(FieldNames!$E:$E,MATCH(A937,FieldNames!$A:$A,0)))","v":"[Select a field name]"}]
[null,{"$f":"IF(A938=\"\",\"[Select a field name]\",INDEX(FieldNames!$E:$E,MATCH(A938,FieldNames!$A:$A,0)))","v":"[Select a field name]"}]
[null,{"$f":"IF(A939=\"\",\"[Select a field name]\",INDEX(FieldNames!$E:$E,MATCH(A939,FieldNames!$A:$A,0)))","v":"[Select a field name]"}]
[null,{"$f":"IF(A940=\"\",\"[Select a field name]\",INDEX(FieldNames!$E:$E,MATCH(A940,FieldNames!$A:$A,0)))","v":"[Select a field name]"}]
[null,{"$f":"IF(A941=\"\",\"[Select a field name]\",INDEX(FieldNames!$E:$E,MATCH(A941,FieldNames!$A:$A,0)))","v":"[Select a field name]"}]
[null,{"$f":"IF(A942=\"\",\"[Select a field name]\",INDEX(FieldNames!$E:$E,MATCH(A942,FieldNames!$A:$A,0)))","v":"[Select a field name]"}]
[null,{"$f":"IF(A943=\"\",\"[Select a field name]\",INDEX(FieldNames!$E:$E,MATCH(A943,FieldNames!$A:$A,0)))","v":"[Select a field name]"}]
[null,""]
["GP3Pre-HS On- to Off-Track Report","GP3Pre-HS On- to Off-Track Report"]
["Pre-HS Indicator",{"$f":"IF(A946=\"\",\"[Select a field name]\",INDEX(FieldNames!$E:$E,MATCH(A946,FieldNames!$A:$A,0)))","v":"Incoming Risk Indicator"},{"$f":"\"=0\"","v":"=0"}]
["GP3_Any flag",{"$f":"IF(A947=\"\",\"[Select a field name]\",INDEX(FieldNames!$E:$E,MATCH(A947,FieldNames!$A:$A,0)))","v":"Quarter 3 Any Flag"},{"$f":"\"=1\"","v":"=1"}]
["Cohort",{"$f":"IF(A948=\"\",\"[Select a field name]\",INDEX(FieldNames!$E:$E,MATCH(A948,FieldNames!$A:$A,0)))","v":"Cohort"},{"$f":"\"=\"&IF(StudentRptCohort=\"All\",\"*\",StudentRptCohort)","v":"=*"}]
[null,{"$f":"IF(A949=\"\",\"[Select a field name]\",INDEX(FieldNames!$E:$E,MATCH(A949,FieldNames!$A:$A,0)))","v":"[Select a field name]"}]
[null,{"$f":"IF(A950=\"\",\"[Select a field name]\",INDEX(FieldNames!$E:$E,MATCH(A950,FieldNames!$A:$A,0)))","v":"[Select a field name]"}]
[null,{"$f":"IF(A951=\"\",\"[Select a field name]\",INDEX(FieldNames!$E:$E,MATCH(A951,FieldNames!$A:$A,0)))","v":"[Select a field name]"}]
[null,{"$f":"IF(A952=\"\",\"[Select a field name]\",INDEX(FieldNames!$E:$E,MATCH(A952,FieldNames!$A:$A,0)))","v":"[Select a field name]"}]
[null,{"$f":"IF(A953=\"\",\"[Select a field name]\",INDEX(FieldNames!$E:$E,MATCH(A953,FieldNames!$A:$A,0)))","v":"[Select a field name]"}]
[null,{"$f":"IF(A954=\"\",\"[Select a field name]\",INDEX(FieldNames!$E:$E,MATCH(A954,FieldNames!$A:$A,0)))","v":"[Select a field name]"}]
[null,{"$f":"IF(A955=\"\",\"[Select a field name]\",INDEX(FieldNames!$E:$E,MATCH(A955,FieldNames!$A:$A,0)))","v":"[Select a field name]"}]
[null,""]
["GP4Pre-HS On- to Off-Track Report","GP4Pre-HS On- to Off-Track Report"]
["Pre-HS Indicator",{"$f":"IF(A958=\"\",\"[Select a field name]\",INDEX(FieldNames!$E:$E,MATCH(A958,FieldNames!$A:$A,0)))","v":"Incoming Risk Indicator"},{"$f":"\"=0\"","v":"=0"}]
["GP4_Any flag",{"$f":"IF(A959=\"\",\"[Select a field name]\",INDEX(FieldNames!$E:$E,MATCH(A959,FieldNames!$A:$A,0)))","v":"Quarter 4 Any Flag"},{"$f":"\"=1\"","v":"=1"}]
["Cohort",{"$f":"IF(A960=\"\",\"[Select a field name]\",INDEX(FieldNames!$E:$E,MATCH(A960,FieldNames!$A:$A,0)))","v":"Cohort"},{"$f":"\"=\"&IF(StudentRptCohort=\"All\",\"*\",StudentRptCohort)","v":"=*"}]
[null,{"$f":"IF(A961=\"\",\"[Select a field name]\",INDEX(FieldNames!$E:$E,MATCH(A961,FieldNames!$A:$A,0)))","v":"[Select a field name]"}]
[null,{"$f":"IF(A962=\"\",\"[Select a field name]\",INDEX(FieldNames!$E:$E,MATCH(A962,FieldNames!$A:$A,0)))","v":"[Select a field name]"}]
[null,{"$f":"IF(A963=\"\",\"[Select a field name]\",INDEX(FieldNames!$E:$E,MATCH(A963,FieldNames!$A:$A,0)))","v":"[Select a field name]"}]
[null,{"$f":"IF(A964=\"\",\"[Select a field name]\",INDEX(FieldNames!$E:$E,MATCH(A964,FieldNames!$A:$A,0)))","v":"[Select a field name]"}]
[null,{"$f":"IF(A965=\"\",\"[Select a field name]\",INDEX(FieldNames!$E:$E,MATCH(A965,FieldNames!$A:$A,0)))","v":"[Select a field name]"}]
[null,{"$f":"IF(A966=\"\",\"[Select a field name]\",INDEX(FieldNames!$E:$E,MATCH(A966,FieldNames!$A:$A,0)))","v":"[Select a field name]"}]
[null,{"$f":"IF(A967=\"\",\"[Select a field name]\",INDEX(FieldNames!$E:$E,MATCH(A967,FieldNames!$A:$A,0)))","v":"[Select a field name]"}]
[null,""]
["yrPre-HS On- to Off-Track Report","yrPre-HS On- to Off-Track Report"]
["Pre-HS Indicator",{"$f":"IF(A970=\"\",\"[Select a field name]\",INDEX(FieldNames!$E:$E,MATCH(A970,FieldNames!$A:$A,0)))","v":"Incoming Risk Indicator"},{"$f":"\"=0\"","v":"=0"}]
["eoy_Any flag",{"$f":"IF(A971=\"\",\"[Select a field name]\",INDEX(FieldNames!$E:$E,MATCH(A971,FieldNames!$A:$A,0)))","v":"End of Year Any Flag"},{"$f":"\"=1\"","v":"=1"}]
["Cohort",{"$f":"IF(A972=\"\",\"[Select a field name]\",INDEX(FieldNames!$E:$E,MATCH(A972,FieldNames!$A:$A,0)))","v":"Cohort"},{"$f":"\"=\"&IF(StudentRptCohort=\"All\",\"*\",StudentRptCohort)","v":"=*"}]
[null,{"$f":"IF(A973=\"\",\"[Select a field name]\",INDEX(FieldNames!$E:$E,MATCH(A973,FieldNames!$A:$A,0)))","v":"[Select a field name]"}]
[null,{"$f":"IF(A974=\"\",\"[Select a field name]\",INDEX(FieldNames!$E:$E,MATCH(A974,FieldNames!$A:$A,0)))","v":"[Select a field name]"}]
[null,{"$f":"IF(A975=\"\",\"[Select a field name]\",INDEX(FieldNames!$E:$E,MATCH(A975,FieldNames!$A:$A,0)))","v":"[Select a field name]"}]
[null,{"$f":"IF(A976=\"\",\"[Select a field name]\",INDEX(FieldNames!$E:$E,MATCH(A976,FieldNames!$A:$A,0)))","v":"[Select a field name]"}]
[null,{"$f":"IF(A977=\"\",\"[Select a field name]\",INDEX(FieldNames!$E:$E,MATCH(A977,FieldNames!$A:$A,0)))","v":"[Select a field name]"}]
[null,{"$f":"IF(A978=\"\",\"[Select a field name]\",INDEX(FieldNames!$E:$E,MATCH(A978,FieldNames!$A:$A,0)))","v":"[Select a field name]"}]
[null,{"$f":"IF(A979=\"\",\"[Select a field name]\",INDEX(FieldNames!$E:$E,MATCH(A979,FieldNames!$A:$A,0)))","v":"[Select a field name]"}]
[null,""]
["FullPre-HS On- to Off-Track Report","FullPre-HS On- to Off-Track Report"]
["Pre-HS Indicator",{"$f":"IF(A982=\"\",\"[Select a field name]\",INDEX(FieldNames!$E:$E,MATCH(A982,FieldNames!$A:$A,0)))","v":"Incoming Risk Indicator"},{"$f":"\"=0\"","v":"=0"}]
["eoy_Any flag",{"$f":"IF(A983=\"\",\"[Select a field name]\",INDEX(FieldNames!$E:$E,MATCH(A983,FieldNames!$A:$A,0)))","v":"End of Year Any Flag"},{"$f":"\"=1\"","v":"=1"}]
["Cohort",{"$f":"IF(A984=\"\",\"[Select a field name]\",INDEX(FieldNames!$E:$E,MATCH(A984,FieldNames!$A:$A,0)))","v":"Cohort"},{"$f":"\"=\"&IF(StudentRptCohort=\"All\",\"*\",StudentRptCohort)","v":"=*"}]
[null,{"$f":"IF(A985=\"\",\"[Select a field name]\",INDEX(FieldNames!$E:$E,MATCH(A985,FieldNames!$A:$A,0)))","v":"[Select a field name]"}]
[null,{"$f":"IF(A986=\"\",\"[Select a field name]\",INDEX(FieldNames!$E:$E,MATCH(A986,FieldNames!$A:$A,0)))","v":"[Select a field name]"}]
[null,{"$f":"IF(A987=\"\",\"[Select a field name]\",INDEX(FieldNames!$E:$E,MATCH(A987,FieldNames!$A:$A,0)))","v":"[Select a field name]"}]
[null,{"$f":"IF(A988=\"\",\"[Select a field name]\",INDEX(FieldNames!$E:$E,MATCH(A988,FieldNames!$A:$A,0)))","v":"[Select a field name]"}]
[null,{"$f":"IF(A989=\"\",\"[Select a field name]\",INDEX(FieldNames!$E:$E,MATCH(A989,FieldNames!$A:$A,0)))","v":"[Select a field name]"}]
[null,{"$f":"IF(A990=\"\",\"[Select a field name]\",INDEX(FieldNames!$E:$E,MATCH(A990,FieldNames!$A:$A,0)))","v":"[Select a field name]"}]
[null,{"$f":"IF(A991=\"\",\"[Select a field name]\",INDEX(FieldNames!$E:$E,MATCH(A991,FieldNames!$A:$A,0)))","v":"[Select a field name]"}]
[]
["GP1Flagged student intervention report","GP1Flagged student intervention report"]
["GP1_Any Flag",{"$f":"IF(A994=\"\",\"[Select a field name]\",INDEX(FieldNames!$E:$E,MATCH(A994,FieldNames!$A:$A,0)))","v":"Quarter 1 Any Flag"},{"$f":"\"=1\"","v":"=1"}]
["Cohort",{"$f":"IF(A995=\"\",\"[Select a field name]\",INDEX(FieldNames!$E:$E,MATCH(A995,FieldNames!$A:$A,0)))","v":"Cohort"},{"$f":"\"=\"&IF(StudentRptCohort=\"All\",\"*\",StudentRptCohort)","v":"=*"}]
[null,{"$f":"IF(A996=\"\",\"[Select a field name]\",INDEX(FieldNames!$E:$E,MATCH(A996,FieldNames!$A:$A,0)))","v":"[Select a field name]"}]
[null,{"$f":"IF(A997=\"\",\"[Select a field name]\",INDEX(FieldNames!$E:$E,MATCH(A997,FieldNames!$A:$A,0)))","v":"[Select a field name]"}]
[null,{"$f":"IF(A998=\"\",\"[Select a field name]\",INDEX(FieldNames!$E:$E,MATCH(A998,FieldNames!$A:$A,0)))","v":"[Select a field name]"}]
[null,{"$f":"IF(A999=\"\",\"[Select a field name]\",INDEX(FieldNames!$E:$E,MATCH(A999,FieldNames!$A:$A,0)))","v":"[Select a field name]"}]
[null,{"$f":"IF(A1000=\"\",\"[Select a field name]\",INDEX(FieldNames!$E:$E,MATCH(A1000,FieldNames!$A:$A,0)))","v":"[Select a field name]"}]
[null,{"$f":"IF(A1001=\"\",\"[Select a field name]\",INDEX(FieldNames!$E:$E,MATCH(A1001,FieldNames!$A:$A,0)))","v":"[Select a field name]"}]
[null,{"$f":"IF(A1002=\"\",\"[Select a field name]\",INDEX(FieldNames!$E:$E,MATCH(A1002,FieldNames!$A:$A,0)))","v":"[Select a field name]"}]
[null,{"$f":"IF(A1003=\"\",\"[Select a field name]\",INDEX(FieldNames!$E:$E,MATCH(A1003,FieldNames!$A:$A,0)))","v":"[Select a field name]"}]
[null,""]
["GP2Flagged student intervention report","GP2Flagged student intervention report"]
["GP2_Any Flag",{"$f":"IF(A1006=\"\",\"[Select a field name]\",INDEX(FieldNames!$E:$E,MATCH(A1006,FieldNames!$A:$A,0)))","v":"Quarter 2 Any Flag"},{"$f":"\"=1\"","v":"=1"}]
["Cohort",{"$f":"IF(A1007=\"\",\"[Select a field name]\",INDEX(FieldNames!$E:$E,MATCH(A1007,FieldNames!$A:$A,0)))","v":"Cohort"},{"$f":"\"=\"&IF(StudentRptCohort=\"All\",\"*\",StudentRptCohort)","v":"=*"}]
[null,{"$f":"IF(A1008=\"\",\"[Select a field name]\",INDEX(FieldNames!$E:$E,MATCH(A1008,FieldNames!$A:$A,0)))","v":"[Select a field name]"}]
[null,{"$f":"IF(A1009=\"\",\"[Select a field name]\",INDEX(FieldNames!$E:$E,MATCH(A1009,FieldNames!$A:$A,0)))","v":"[Select a field name]"}]
[null,{"$f":"IF(A1010=\"\",\"[Select a field name]\",INDEX(FieldNames!$E:$E,MATCH(A1010,FieldNames!$A:$A,0)))","v":"[Select a field name]"}]
[null,{"$f":"IF(A1011=\"\",\"[Select a field name]\",INDEX(FieldNames!$E:$E,MATCH(A1011,FieldNames!$A:$A,0)))","v":"[Select a field name]"}]
[null,{"$f":"IF(A1012=\"\",\"[Select a field name]\",INDEX(FieldNames!$E:$E,MATCH(A1012,FieldNames!$A:$A,0)))","v":"[Select a field name]"}]
[null,{"$f":"IF(A1013=\"\",\"[Select a field name]\",INDEX(FieldNames!$E:$E,MATCH(A1013,FieldNames!$A:$A,0)))","v":"[Select a field name]"}]
[null,{"$f":"IF(A1014=\"\",\"[Select a field name]\",INDEX(FieldNames!$E:$E,MATCH(A1014,FieldNames!$A:$A,0)))","v":"[Select a field name]"}]
[null,{"$f":"IF(A1015=\"\",\"[Select a field name]\",INDEX(FieldNames!$E:$E,MATCH(A1015,FieldNames!$A:$A,0)))","v":"[Select a field name]"}]
[null,""]
["GP3Flagged student intervention report","GP3Flagged student intervention report"]
["GP3_Any Flag",{"$f":"IF(A1018=\"\",\"[Select a field name]\",INDEX(FieldNames!$E:$E,MATCH(A1018,FieldNames!$A:$A,0)))","v":"Quarter 3 Any Flag"},{"$f":"\"=1\"","v":"=1"}]
["Cohort",{"$f":"IF(A1019=\"\",\"[Select a field name]\",INDEX(FieldNames!$E:$E,MATCH(A1019,FieldNames!$A:$A,0)))","v":"Cohort"},{"$f":"\"=\"&IF(StudentRptCohort=\"All\",\"*\",StudentRptCohort)","v":"=*"}]
[null,{"$f":"IF(A1020=\"\",\"[Select a field name]\",INDEX(FieldNames!$E:$E,MATCH(A1020,FieldNames!$A:$A,0)))","v":"[Select a field name]"}]
[null,{"$f":"IF(A1021=\"\",\"[Select a field name]\",INDEX(FieldNames!$E:$E,MATCH(A1021,FieldNames!$A:$A,0)))","v":"[Select a field name]"}]
[null,{"$f":"IF(A1022=\"\",\"[Select a field name]\",INDEX(FieldNames!$E:$E,MATCH(A1022,FieldNames!$A:$A,0)))","v":"[Select a field name]"}]
[null,{"$f":"IF(A1023=\"\",\"[Select a field name]\",INDEX(FieldNames!$E:$E,MATCH(A1023,FieldNames!$A:$A,0)))","v":"[Select a field name]"}]
[null,{"$f":"IF(A1024=\"\",\"[Select a field name]\",INDEX(FieldNames!$E:$E,MATCH(A1024,FieldNames!$A:$A,0)))","v":"[Select a field name]"}]
[null,{"$f":"IF(A1025=\"\",\"[Select a field name]\",INDEX(FieldNames!$E:$E,MATCH(A1025,FieldNames!$A:$A,0)))","v":"[Select a field name]"}]
[null,{"$f":"IF(A1026=\"\",\"[Select a field name]\",INDEX(FieldNames!$E:$E,MATCH(A1026,FieldNames!$A:$A,0)))","v":"[Select a field name]"}]
[null,{"$f":"IF(A1027=\"\",\"[Select a field name]\",INDEX(FieldNames!$E:$E,MATCH(A1027,FieldNames!$A:$A,0)))","v":"[Select a field name]"}]
[null,""]
["GP4Flagged student intervention report","GP4Flagged student intervention report"]
["GP4_Any Flag",{"$f":"IF(A1030=\"\",\"[Select a field name]\",INDEX(FieldNames!$E:$E,MATCH(A1030,FieldNames!$A:$A,0)))","v":"Quarter 4 Any Flag"},{"$f":"\"=1\"","v":"=1"}]
["Cohort",{"$f":"IF(A1031=\"\",\"[Select a field name]\",INDEX(FieldNames!$E:$E,MATCH(A1031,FieldNames!$A:$A,0)))","v":"Cohort"},{"$f":"\"=\"&IF(StudentRptCohort=\"All\",\"*\",StudentRptCohort)","v":"=*"}]
[null,{"$f":"IF(A1032=\"\",\"[Select a field name]\",INDEX(FieldNames!$E:$E,MATCH(A1032,FieldNames!$A:$A,0)))","v":"[Select a field name]"}]
[null,{"$f":"IF(A1033=\"\",\"[Select a field name]\",INDEX(FieldNames!$E:$E,MATCH(A1033,FieldNames!$A:$A,0)))","v":"[Select a field name]"}]
[null,{"$f":"IF(A1034=\"\",\"[Select a field name]\",INDEX(FieldNames!$E:$E,MATCH(A1034,FieldNames!$A:$A,0)))","v":"[Select a field name]"}]
[null,{"$f":"IF(A1035=\"\",\"[Select a field name]\",INDEX(FieldNames!$E:$E,MATCH(A1035,FieldNames!$A:$A,0)))","v":"[Select a field name]"}]
[null,{"$f":"IF(A1036=\"\",\"[Select a field name]\",INDEX(FieldNames!$E:$E,MATCH(A1036,FieldNames!$A:$A,0)))","v":"[Select a field name]"}]
[null,{"$f":"IF(A1037=\"\",\"[Select a field name]\",INDEX(FieldNames!$E:$E,MATCH(A1037,FieldNames!$A:$A,0)))","v":"[Select a field name]"}]
[null,{"$f":"IF(A1038=\"\",\"[Select a field name]\",INDEX(FieldNames!$E:$E,MATCH(A1038,FieldNames!$A:$A,0)))","v":"[Select a field name]"}]
[null,{"$f":"IF(A1039=\"\",\"[Select a field name]\",INDEX(FieldNames!$E:$E,MATCH(A1039,FieldNames!$A:$A,0)))","v":"[Select a field name]"}]
[null,""]
["yrFlagged student intervention report","yrFlagged student intervention report"]
["eoy_Any flag",{"$f":"IF(A1042=\"\",\"[Select a field name]\",INDEX(FieldNames!$E:$E,MATCH(A1042,FieldNames!$A:$A,0)))","v":"End of Year Any Flag"},{"$f":"\"=1\"","v":"=1"}]
["Cohort",{"$f":"IF(A1043=\"\",\"[Select a field name]\",INDEX(FieldNames!$E:$E,MATCH(A1043,FieldNames!$A:$A,0)))","v":"Cohort"},{"$f":"\"=\"&IF(StudentRptCohort=\"All\",\"*\",StudentRptCohort)","v":"=*"}]
[null,{"$f":"IF(A1044=\"\",\"[Select a field name]\",INDEX(FieldNames!$E:$E,MATCH(A1044,FieldNames!$A:$A,0)))","v":"[Select a field name]"}]
[null,{"$f":"IF(A1045=\"\",\"[Select a field name]\",INDEX(FieldNames!$E:$E,MATCH(A1045,FieldNames!$A:$A,0)))","v":"[Select a field name]"}]
[null,{"$f":"IF(A1046=\"\",\"[Select a field name]\",INDEX(FieldNames!$E:$E,MATCH(A1046,FieldNames!$A:$A,0)))","v":"[Select a field name]"}]
[null,{"$f":"IF(A1047=\"\",\"[Select a field name]\",INDEX(FieldNames!$E:$E,MATCH(A1047,FieldNames!$A:$A,0)))","v":"[Select a field name]"}]
[null,{"$f":"IF(A1048=\"\",\"[Select a field name]\",INDEX(FieldNames!$E:$E,MATCH(A1048,FieldNames!$A:$A,0)))","v":"[Select a field name]"}]
[null,{"$f":"IF(A1049=\"\",\"[Select a field name]\",INDEX(FieldNames!$E:$E,MATCH(A1049,FieldNames!$A:$A,0)))","v":"[Select a field name]"}]
[null,{"$f":"IF(A1050=\"\",\"[Select a field name]\",INDEX(FieldNames!$E:$E,MATCH(A1050,FieldNames!$A:$A,0)))","v":"[Select a field name]"}]
[null,{"$f":"IF(A1051=\"\",\"[Select a field name]\",INDEX(FieldNames!$E:$E,MATCH(A1051,FieldNames!$A:$A,0)))","v":"[Select a field name]"}]
[null,""]
["FullFlagged student intervention report","FullFlagged student intervention report"]
["Any flag",{"$f":"IF(A1054=\"\",\"[Select a field name]\",INDEX(FieldNames!$E:$E,MATCH(A1054,FieldNames!$A:$A,0)))","v":"Any Flag"},{"$f":"\"=1\"","v":"=1"}]
["Pre-HS indicator",{"$f":"IF(A1055=\"\",\"[Select a field name]\",INDEX(FieldNames!$E:$E,MATCH(A1055,FieldNames!$A:$A,0)))","v":"Incoming Risk Indicator"},null,{"$f":"\"=1\"","v":"=1"}]
["Cohort",{"$f":"IF(A1056=\"\",\"[Select a field name]\",INDEX(FieldNames!$E:$E,MATCH(A1056,FieldNames!$A:$A,0)))","v":"Cohort"},{"$f":"\"=\"&IF(StudentRptCohort=\"All\",\"*\",StudentRptCohort)","v":"=*"},{"$f":"\"=\"&IF(StudentRptCohort=\"All\",\"*\",StudentRptCohort)","v":"=*"}]
[null,{"$f":"IF(A1057=\"\",\"[Select a field name]\",INDEX(FieldNames!$E:$E,MATCH(A1057,FieldNames!$A:$A,0)))","v":"[Select a field name]"}]
[null,{"$f":"IF(A1058=\"\",\"[Select a field name]\",INDEX(FieldNames!$E:$E,MATCH(A1058,FieldNames!$A:$A,0)))","v":"[Select a field name]"}]
[null,{"$f":"IF(A1059=\"\",\"[Select a field name]\",INDEX(FieldNames!$E:$E,MATCH(A1059,FieldNames!$A:$A,0)))","v":"[Select a field name]"}]
[null,{"$f":"IF(A1060=\"\",\"[Select a field name]\",INDEX(FieldNames!$E:$E,MATCH(A1060,FieldNames!$A:$A,0)))","v":"[Select a field name]"}]
[null,{"$f":"IF(A1061=\"\",\"[Select a field name]\",INDEX(FieldNames!$E:$E,MATCH(A1061,FieldNames!$A:$A,0)))","v":"[Select a field name]"}]
[null,{"$f":"IF(A1062=\"\",\"[Select a field name]\",INDEX(FieldNames!$E:$E,MATCH(A1062,FieldNames!$A:$A,0)))","v":"[Select a field name]"}]
[null,{"$f":"IF(A1063=\"\",\"[Select a field name]\",INDEX(FieldNames!$E:$E,MATCH(A1063,FieldNames!$A:$A,0)))","v":"[Select a field name]"}]

{"sheet":"i_FullYearReportDefs","index":20,"n_rows":39,"n_cols":28,"rows_kept":39,"cut":false,"hidden":true,"merged":[]}
["Quarters","FullFlagged student report","Pre-HS indicator",{"$f":"\"GP1_First \"&EarlyAtt&\" Day Attendance\"","v":"GP1_First 20 Day Attendance"},"GP1_Attendance","GP1_EngCourseFail","GP1_MathCourseFail","GP1_Behavior","GP2_Attendance","GP2_EngCourseFail","GP2_MathCourseFail","GP2_Behavior","GP3_Attendance","GP3_EngCourseFail","GP3_MathCourseFail","GP3_Behavior","GP4_Attendance","GP4_EngCourseFail","GP4_MathCourseFail","GP4_Behavior","eoy_Attendance","eoy_EngCourseFail","eoy_MathCourseFail","eoy_Behavior"]
["Trimesters",null,"Pre-HS indicator","GP1_First 20 Day Attendance","GP1_Attendance","GP1_EngCourseFail","GP1_MathCourseFail","GP1_Behavior","GP2_Attendance","GP2_EngCourseFail","GP2_MathCourseFail","GP2_Behavior","GP3_Attendance","GP3_EngCourseFail","GP3_MathCourseFail","GP3_Behavior","eoy_Attendance","eoy_EngCourseFail","eoy_MathCourseFail","eoy_Behavior"]
["Semesters",null,"Pre-HS indicator","GP1_First 20 Day Attendance","GP1_Attendance","GP1_EngCourseFail","GP1_MathCourseFail","GP1_Behavior","GP2_Attendance","GP2_EngCourseFail","GP2_MathCourseFail","GP2_Behavior","eoy_Attendance","eoy_EngCourseFail","eoy_MathCourseFail","eoy_Behavior"]
["Quarters","FullFlagged student report: Academics","Pre-HS indicator","GP1_First 20 Day Attendance","GP1_Attendance","GP1_EngCourseFail","GP1_MathCourseFail","GP1_Behavior","GP2_Attendance","GP2_EngCourseFail","GP2_MathCourseFail","GP2_Behavior","GP3_Attendance","GP3_EngCourseFail","GP3_MathCourseFail","GP3_Behavior","GP4_Attendance","GP4_EngCourseFail","GP4_MathCourseFail","GP4_Behavior","eoy_Attendance","eoy_EngCourseFail","eoy_MathCourseFail","eoy_Behavior"]
["Trimesters",null,"Pre-HS indicator","GP1_First 20 Day Attendance","GP1_Attendance","GP1_EngCourseFail","GP1_MathCourseFail","GP1_Behavior","GP2_Attendance","GP2_EngCourseFail","GP2_MathCourseFail","GP2_Behavior","GP3_Attendance","GP3_EngCourseFail","GP3_MathCourseFail","GP3_Behavior","eoy_Attendance","eoy_EngCourseFail","eoy_MathCourseFail","eoy_Behavior"]
["Semesters",null,"Pre-HS indicator","GP1_First 20 Day Attendance","GP1_Attendance","GP1_EngCourseFail","GP1_MathCourseFail","GP1_Behavior","GP2_Attendance","GP2_EngCourseFail","GP2_MathCourseFail","GP2_Behavior","eoy_Attendance","eoy_EngCourseFail","eoy_MathCourseFail","eoy_Behavior"]
["Quarters","FullFlagged student report: Attendance","Pre-HS indicator","GP1_First 20 Day Attendance","GP1_Attendance","GP1_EngCourseFail","GP1_MathCourseFail","GP1_Behavior","GP2_Attendance","GP2_EngCourseFail","GP2_MathCourseFail","GP2_Behavior","GP3_Attendance","GP3_EngCourseFail","GP3_MathCourseFail","GP3_Behavior","GP4_Attendance","GP4_EngCourseFail","GP4_MathCourseFail","GP4_Behavior","eoy_Attendance","eoy_EngCourseFail","eoy_MathCourseFail","eoy_Behavior"]
["Trimesters",null,"Pre-HS indicator","GP1_First 20 Day Attendance","GP1_Attendance","GP1_EngCourseFail","GP1_MathCourseFail","GP1_Behavior","GP2_Attendance","GP2_EngCourseFail","GP2_MathCourseFail","GP2_Behavior","GP3_Attendance","GP3_EngCourseFail","GP3_MathCourseFail","GP3_Behavior","eoy_Attendance","eoy_EngCourseFail","eoy_MathCourseFail","eoy_Behavior"]
["Semesters",null,"Pre-HS indicator","GP1_First 20 Day Attendance","GP1_Attendance","GP1_EngCourseFail","GP1_MathCourseFail","GP1_Behavior","GP2_Attendance","GP2_EngCourseFail","GP2_MathCourseFail","GP2_Behavior","eoy_Attendance","eoy_EngCourseFail","eoy_MathCourseFail","eoy_Behavior"]
["Quarters","FullFlagged Student Report: Disabilities","Disability","GP1_First 20 Day Attendance","GP1_Attendance","GP1_EngCourseFail","GP1_MathCourseFail","GP1_Behavior","GP1 Interventions","GP2_Attendance","GP2_EngCourseFail","GP2_MathCourseFail","GP2_Behavior","GP2 Interventions","GP3_Attendance","GP3_EngCourseFail","GP3_MathCourseFail","GP3_Behavior","GP3 Interventions","GP4_Attendance","GP4_EngCourseFail","GP4_MathCourseFail","GP4_Behavior","GP4 Interventions","eoy_Attendance","eoy_EngCourseFail","eoy_MathCourseFail","eoy_Behavior"]
["Trimesters",null,"Disability","GP1_First 20 Day Attendance","GP1_Attendance","GP1_EngCourseFail","GP1_MathCourseFail","GP1_Behavior","GP1 Interventions","GP2_Attendance","GP2_EngCourseFail","GP2_MathCourseFail","GP2_Behavior","GP2 Interventions","GP3_Attendance","GP3_EngCourseFail","GP3_MathCourseFail","GP3_Behavior","GP3 Interventions","eoy_Attendance","eoy_EngCourseFail","eoy_MathCourseFail","eoy_Behavior"]
["Semesters",null,"Disability","GP1_First 20 Day Attendance","GP1_Attendance","GP1_EngCourseFail","GP1_MathCourseFail","GP1_Behavior","GP1 Interventions","GP2_Attendance","GP2_EngCourseFail","GP2_MathCourseFail","GP2_Behavior","GP2 Interventions","eoy_Attendance","eoy_EngCourseFail","eoy_MathCourseFail","eoy_Behavior"]
["Quarters","FullFlagged Student Report: ELL","ELL status","GP1_First 20 Day Attendance","GP1_Attendance","GP1_EngCourseFail","GP1_MathCourseFail","GP1_Behavior","GP1 Interventions","GP2_Attendance","GP2_EngCourseFail","GP2_MathCourseFail","GP2_Behavior","GP2 Interventions","GP3_Attendance","GP3_EngCourseFail","GP3_MathCourseFail","GP3_Behavior","GP3 Interventions","GP4_Attendance","GP4_EngCourseFail","GP4_MathCourseFail","GP4_Behavior","GP4 Interventions","eoy_Attendance","eoy_EngCourseFail","eoy_MathCourseFail","eoy_Behavior"]
["Trimesters",null,"ELL status","GP1_First 20 Day Attendance","GP1_Attendance","GP1_EngCourseFail","GP1_MathCourseFail","GP1_Behavior","GP1 Interventions","GP2_Attendance","GP2_EngCourseFail","GP2_MathCourseFail","GP2_Behavior","GP2 Interventions","GP3_Attendance","GP3_EngCourseFail","GP3_MathCourseFail","GP3_Behavior","GP3 Interventions","eoy_Attendance","eoy_EngCourseFail","eoy_MathCourseFail","eoy_Behavior"]
["Semesters",null,"ELL status","GP1_First 20 Day Attendance","GP1_Attendance","GP1_EngCourseFail","GP1_MathCourseFail","GP1_Behavior","GP1 Interventions","GP2_Attendance","GP2_EngCourseFail","GP2_MathCourseFail","GP2_Behavior","GP2 Interventions","eoy_Attendance","eoy_EngCourseFail","eoy_MathCourseFail","eoy_Behavior"]
["Quarters","FullFlagged Student Report: Disadvantaged","Disadvantaged","GP1_First 20 Day Attendance","GP1_Attendance","GP1_EngCourseFail","GP1_MathCourseFail","GP1_Behavior","GP1 Interventions","GP2_Attendance","GP2_EngCourseFail","GP2_MathCourseFail","GP2_Behavior","GP2 Interventions","GP3_Attendance","GP3_EngCourseFail","GP3_MathCourseFail","GP3_Behavior","GP3 Interventions","GP4_Attendance","GP4_EngCourseFail","GP4_MathCourseFail","GP4_Behavior","GP4 Interventions","eoy_Attendance","eoy_EngCourseFail","eoy_MathCourseFail","eoy_Behavior"]
["Trimesters",null,"Disadvantaged","GP1_First 20 Day Attendance","GP1_Attendance","GP1_EngCourseFail","GP1_MathCourseFail","GP1_Behavior","GP1 Interventions","GP2_Attendance","GP2_EngCourseFail","GP2_MathCourseFail","GP2_Behavior","GP2 Interventions","GP3_Attendance","GP3_EngCourseFail","GP3_MathCourseFail","GP3_Behavior","GP3 Interventions","eoy_Attendance","eoy_EngCourseFail","eoy_MathCourseFail","eoy_Behavior"]
["Semesters",null,"Disadvantaged","GP1_First 20 Day Attendance","GP1_Attendance","GP1_EngCourseFail","GP1_MathCourseFail","GP1_Behavior","GP1 Interventions","GP2_Attendance","GP2_EngCourseFail","GP2_MathCourseFail","GP2_Behavior","GP2 Interventions","eoy_Attendance","eoy_EngCourseFail","eoy_MathCourseFail","eoy_Behavior"]
["Quarters","FullIntervention report",{"$f":"\"GP1_First \"&EarlyAtt&\" Day Attendance\"","v":"GP1_First 20 Day Attendance"},"GP1_Attendance","GP1_EngCourseFail","GP1_MathCourseFail","GP1_Behavior","GP1_Int flag","GP2_Attendance","GP2_EngCourseFail","GP2_MathCourseFail","GP2_Behavior","GP2_Int flag","GP3_Attendance","GP3_EngCourseFail","GP3_MathCourseFail","GP3_Behavior","GP3_Int flag","GP4_Attendance","GP4_EngCourseFail","GP4_MathCourseFail","GP4_Behavior","GP4_Int flag","eoy_Attendance","eoy_EngCourseFail","eoy_MathCourseFail","eoy_Behavior"]
["Trimesters",null,{"$f":"\"GP1_First \"&EarlyAtt&\" Day Attendance\"","v":"GP1_First 20 Day Attendance"},"GP1_Attendance","GP1_EngCourseFail","GP1_MathCourseFail","GP1_Behavior","GP1_Int flag","GP2_Attendance","GP2_EngCourseFail","GP2_MathCourseFail","GP2_Behavior","GP2_Int flag","GP3_Attendance","GP3_EngCourseFail","GP3_MathCourseFail","GP3_Behavior","GP3_Int flag","eoy_Attendance","eoy_EngCourseFail","eoy_MathCourseFail","eoy_Behavior"]
["Semesters",null,{"$f":"\"GP1_First \"&EarlyAtt&\" Day Attendance\"","v":"GP1_First 20 Day Attendance"},"GP1_Attendance","GP1_EngCourseFail","GP1_MathCourseFail","GP1_Behavior","GP1_Int flag","GP2_Attendance","GP2_EngCourseFail","GP2_MathCourseFail","GP2_Behavior","GP2_Int flag","eoy_Attendance","eoy_EngCourseFail","eoy_MathCourseFail","eoy_Behavior"]
["Quarters","FullStudent dropout report","Enrollment status","Date of Status Change","GP1_Any att","GP1_Any acad","GP1_Behavior","GP1 Interventions","GP2_Attendance","GP2_Any acad","GP2_Behavior","GP2 Interventions","GP3_Attendance","GP3_Any acad","GP3_Behavior","GP3 Interventions","GP4_Attendance","GP4_Any acad","GP4_Behavior","GP4 Interventions","eoy_Attendance","eoy_Any acad","eoy_Behavior"]
["Trimesters",null,"Enrollment status","Date of Status Change","GP1_Any att","GP1_Any acad","GP1_Behavior","GP1 Interventions","GP2_Attendance","GP2_Any acad","GP2_Behavior","GP2 Interventions","GP3_Attendance","GP3_Any acad","GP3_Behavior","GP3 Interventions","eoy_Attendance","eoy_Any acad","eoy_Behavior"]
["Semesters",null,"Enrollment status","Date of Status Change","GP1_Any att","GP1_Any acad","GP1_Behavior","GP1 Interventions","GP2_Attendance","GP2_Any acad","GP2_Behavior","GP2 Interventions","eoy_Attendance","eoy_Any acad","eoy_Behavior"]
["Quarters","FullStudent transfers","Enrollment status","Date of Status Change","GP1_Any att","GP1_Any acad","GP1_Behavior","GP2_Attendance","GP2_Any acad","GP2_Behavior","GP3_Attendance","GP3_Any acad","GP3_Behavior","GP4_Attendance","GP4_Any acad","GP4_Behavior","eoy_Attendance","eoy_Any acad","eoy_Behavior","eoy_Behavior"]
["Trimesters",null,"Enrollment status","Date of Status Change","GP1_Any att","GP1_Any acad","GP1_Behavior","GP2_Attendance","GP2_Any acad","GP2_Behavior","GP3_Attendance","GP3_Any acad","GP3_Behavior","eoy_Attendance","eoy_Any acad","eoy_Behavior"]
["Semesters",null,"Enrollment status","Date of Status Change","GP1_Any att","GP1_Any acad","GP1_Behavior","GP2_Attendance","GP2_Any acad","GP2_Behavior","eoy_Attendance","eoy_Any acad","eoy_Behavior"]
["Quarters","FullIncoming Indicator of Risk Transition Report","Pre-HS indicator","GP1_Any att","GP1_Any acad","GP1_Behavior","GP1 Interventions","GP2_Attendance","GP2_Any acad","GP2_Behavior","GP2 Interventions","GP3_Attendance","GP3_Any acad","GP3_Behavior","GP3 Interventions","GP4_Attendance","GP4_Any acad","GP4 Interventions","GP4_Behavior","eoy_Attendance","eoy_Any acad","eoy_Behavior"]
["Trimesters",null,"Pre-HS indicator","GP1_Any att","GP1_Any acad","GP1_Behavior","GP1 Interventions","GP2_Attendance","GP2_Any acad","GP2_Behavior","GP2 Interventions","GP3_Attendance","GP3_Any acad","GP3_Behavior","GP3 Interventions","eoy_Attendance","eoy_Any acad","eoy_Behavior"]
["Semesters",null,"Pre-HS indicator","GP1_Any att","GP1_Any acad","GP1_Behavior","GP1 Interventions","GP2_Attendance","GP2_Any acad","GP2_Behavior","GP2 Interventions","eoy_Attendance","eoy_Any acad","eoy_Behavior"]
["Quarters","FullOn- to off-track report","Pre-HS indicator","GP1_Any att","GP1_Any acad","GP1_Behavior","GP1 Interventions","GP2_Attendance","GP2_Any acad","GP2_Behavior","GP2 Interventions","GP3_Attendance","GP3_Any acad","GP3_Behavior","GP3 Interventions","GP4_Attendance","GP4_Any acad","GP4 Interventions","GP4_Behavior","eoy_Attendance","eoy_Any acad","eoy_Behavior"]
["Trimesters",null,"Pre-HS indicator","GP1_Any att","GP1_Any acad","GP1_Behavior","GP1 Interventions","GP2_Attendance","GP2_Any acad","GP2_Behavior","GP2 Interventions","GP3_Attendance","GP3_Any acad","GP3_Behavior","GP3 Interventions","eoy_Attendance","eoy_Any acad","eoy_Behavior"]
["Semesters",null,"Pre-HS indicator","GP1_Any att","GP1_Any acad","GP1_Behavior","GP1 Interventions","GP2_Attendance","GP2_Any acad","GP2_Behavior","GP2 Interventions","eoy_Attendance","eoy_Any acad","eoy_Behavior"]
["Quarters","FullOff- to on-track report","Pre-HS indicator","GP1_Any att","GP1_Any acad","GP1_Behavior","GP1 Interventions","GP2_Attendance","GP2_Any acad","GP2_Behavior","GP2 Interventions","GP3_Attendance","GP3_Any acad","GP3_Behavior","GP3 Interventions","GP4_Attendance","GP4_Any acad","GP4 Interventions","GP4_Behavior","eoy_Attendance","eoy_Any acad","eoy_Behavior"]
["Trimesters",null,"Pre-HS indicator","GP1_Any att","GP1_Any acad","GP1_Behavior","GP1 Interventions","GP2_Attendance","GP2_Any acad","GP2_Behavior","GP2 Interventions","GP3_Attendance","GP3_Any acad","GP3_Behavior","GP3 Interventions","eoy_Attendance","eoy_Any acad","eoy_Behavior"]
["Semesters",null,"Pre-HS indicator","GP1_Any att","GP1_Any acad","GP1_Behavior","GP1 Interventions","GP2_Attendance","GP2_Any acad","GP2_Behavior","GP2 Interventions","eoy_Attendance","eoy_Any acad","eoy_Behavior"]
["Quarters","FullFlagged student intervention report","Pre-HS indicator",{"$f":"\"GP1_First \"&EarlyAtt&\" Day Attendance\"","v":"GP1_First 20 Day Attendance"},"GP1_Attendance","GP1_EngCourseFail","GP1_MathCourseFail","GP1_Behavior","GP1 Interventions","GP2_Attendance","GP2_EngCourseFail","GP2_MathCourseFail","GP2_Behavior","GP2 Interventions","GP3_Attendance","GP3_EngCourseFail","GP3_MathCourseFail","GP3_Behavior","GP3 Interventions","GP4_Attendance","GP4_EngCourseFail","GP4_MathCourseFail","GP4_Behavior","GP4 Interventions","eoy_Attendance","eoy_EngCourseFail","eoy_MathCourseFail","eoy_Behavior"]
["Trimesters",null,"Pre-HS indicator",{"$f":"\"GP1_First \"&EarlyAtt&\" Day Attendance\"","v":"GP1_First 20 Day Attendance"},"GP1_Attendance","GP1_EngCourseFail","GP1_MathCourseFail","GP1_Behavior","GP1 Interventions","GP2_Attendance","GP2_EngCourseFail","GP2_MathCourseFail","GP2_Behavior","GP2 Interventions","GP3_Attendance","GP3_EngCourseFail","GP3_MathCourseFail","GP3_Behavior","GP3 Interventions","eoy_Attendance","eoy_EngCourseFail","eoy_MathCourseFail","eoy_Behavior"]
["Semesters",null,"Pre-HS indicator",{"$f":"\"GP1_First \"&EarlyAtt&\" Day Attendance\"","v":"GP1_First 20 Day Attendance"},"GP1_Attendance","GP1_EngCourseFail","GP1_MathCourseFail","GP1_Behavior","GP1 Interventions","GP2_Attendance","GP2_EngCourseFail","GP2_MathCourseFail","GP2_Behavior","GP2 Interventions","eoy_Attendance","eoy_EngCourseFail","eoy_MathCourseFail","eoy_Behavior"]

{"sheet":"o_IntSum","index":21,"n_rows":27,"n_cols":28,"rows_kept":27,"cut":false,"hidden":false,"merged":[[11,12,12,15],[11,3,12,5],[3,3,4,8],[6,7,9,15],[11,6,12,10]]}
[]
[]
[]
[null,null,null,"Student Level Intervention Summary Report      "]
[]
[]
[null,null,null,null,"Filter by Demographics:",1,null,"The student-level intervention summary report shows all students, their indicators of risk (flagged or not flagged), and the number of interventions of each type (attendance, behavior, or academic) assigned to each student during a selected grading period. Please refer to the 'More Info' button for additional information about this report."]
[null,null,null,null,"Filter by Cohort:",1]
[]
[null,null,null,null,"View:",1]
[null,null,null,{"$f":"IF(F10=6,\"Note that if a single intervention covers multiple grading periods, it will only be counted once in the end of year totals.\",\"\")","v":""}]
[null,null,null,"Student Information",null,null,{"$f":"IF(INDEX($X$16:$X$21,$F$10)=1,\"\",INDEX($U$16:$U$21,$F$10)&\" Indicators of Risk\")","v":"Incoming Indicators of Risk"},null,null,null,null,null,{"$f":"IF(INDEX($X$16:$X$21,$F$10)=1,\"\",IF(INDEX($U$16:$U$21,$F$10)=\"End of year\",\"All\",INDEX($U$16:$U$21,$F$10))&\" Interventions\")","v":"Incoming Interventions"}]
[]
[null,null,null,"Student ID","First name","Last name",{"$f":"IF(OR($G$12=\"\",F14=0),0,IF($F$10=1,\"Flag for Incoming Indicator\",IF($F$10=-1,\"Flag for Exam Performance\",OFFSET(c_IndCalcs!K13,0,$V$15))))","v":"Flag for Incoming Indicator"},{"$f":"IF(OR(G14=0,$G$12=\"\"),0,IF($F$10<2,\"\",OFFSET(c_IndCalcs!L13,0,$V$15)))","v":""},{"$f":"IF(OR(H14=0,$G$12=\"\"),0,IF($F$10<2,\"\",OFFSET(c_IndCalcs!M13,0,$V$15)))","v":""},{"$f":"IF(OR(I14=0,$G$12=\"\"),0,IF($F$10<2,\"\",OFFSET(c_IndCalcs!N13,0,$V$15)))","v":""},{"$f":"IF(OR(J14=0,$G$12=\"\"),0,IF($F$10<2,\"\",OFFSET(c_IndCalcs!O13,0,$V$15)))","v":""},null,"Attendance","Behavior","Academic","Total",null,null,null,null,"Don't remove:"]
[null,{"$f":"i_StudentInfo!M14","v":0},{"$f":"c_ReportData!Q13&c_ReportData!R13&c_ReportData!S13&c_ReportData!N13","v":""},{"$f":"i_StudentInfo!D14","v":0},{"$f":"i_StudentInfo!B14","v":0},{"$f":"i_StudentInfo!C14","v":0},{"$f":"IF(OR($D15=\"\",G$14=\"\",G$14=0),\"\",IF(G$14=\"Flag for Incoming Indicator\",c_IndCalcs!$H14,IF(G$14=\"Flag for Exam Performance\",c_IndCalcs!$I14,OFFSET(c_IndCalcs!K14,0,$V$15))))","v":"--"},{"$f":"IF(OR($D15=\"\",H$14=\"\",H$14=0),\"\",OFFSET(c_IndCalcs!L14,0,$V$15))","v":""},{"$f":"IF(OR($D15=\"\",I$14=\"\",I$14=0),\"\",OFFSET(c_IndCalcs!M14,0,$V$15))","v":""},{"$f":"IF(OR($D15=\"\",J$14=\"\",J$14=0),\"\",OFFSET(c_IndCalcs!N14,0,$V$15))","v":""},{"$f":"IF(OR($D15=\"\",K$14=\"\",K$14=0),\"\",OFFSET(c_IndCalcs!O14,0,$V$15))","v":""},null,{"$f":"IF($W$15=-1,COUNTIF(i_Int!$S:$S,$D15&M$14&\"*\"),SUMIF(i_Int!$S:$S,$D15&M$14&\"*\",OFFSET(i_Int!$N:$N,0,$W$15)))","v":0},{"$f":"IF($W$15=-1,COUNTIF(i_Int!$S:$S,$D15&N$14&\"*\"),SUMIF(i_Int!$S:$S,$D15&N$14&\"*\",OFFSET(i_Int!$N:$N,0,$W$15)))","v":0},{"$f":"IF($W$15=-1,COUNTIF(i_Int!$S:$S,$D15&O$14&\"*\"),SUMIF(i_Int!$S:$S,$D15&O$14&\"*\",OFFSET(i_Int!$N:$N,0,$W$15)))","v":0},{"$f":"IF($W$15=-1,COUNTIF(i_Int!$B:$B,$D15),SUMIF(i_Int!$B:$B,$D15,OFFSET(i_Int!$N:$N,0,$W$15)))","v":0},null,null,{"$f":"SUM(G15:J15)","v":0},{"$f":"COUNTA(P:P)-1","v":1},null,{"$f":"INDEX(V$16:V$21,$F$10)","v":0},{"$f":"INDEX(W$16:W$21,$F$10)","v":0}]
[null,null,null,null,null,null,null,null,null,null,null,null,null,null,null,null,null,null,null,null,"Incoming",0,0,{"$f":"IF(U16=\"\",1,\"\")","v":""},null,null,null,{"$f":"INDEX($AB$17:$AB$21,$F$7)&IF($F$8=1,\"*\",INDEX($AA$17:$AA$27,$F$8))","v":"???*"}]
[null,null,null,null,null,null,null,null,null,null,null,null,null,null,null,null,null,null,null,null,{"$f":"i_Settings!$B12","v":"Quarter 1"},{"$f":"MATCH(Y17,c_IndCalcs!$11:$11,0)-MATCH($Y$17,c_IndCalcs!$11:$11,0)","v":0},1,{"$f":"IF(U17=\"\",1,\"\")","v":""},{"$f":"IF(U17=\"\",\"\",U17&\" Indicators of risk\")","v":"Quarter 1 Indicators of risk"},"All","All","???"]
[null,null,null,null,null,null,null,null,null,null,null,null,null,null,null,null,null,null,null,null,{"$f":"i_Settings!$B13","v":"Quarter 2"},{"$f":"MATCH(Y18,c_IndCalcs!$11:$11,0)-MATCH($Y$17,c_IndCalcs!$11:$11,0)","v":7},2,"",{"$f":"IF(U18=\"\",\"\",U18&\" Indicators of risk\")","v":"Quarter 2 Indicators of risk"},"Disabilities",{"$f":"IF(i_Settings!$G25=\"\",\"\",i_Settings!$G25)","v":"Cohort A"},"1??"]
[null,null,null,null,null,null,null,null,null,null,null,null,null,null,null,null,null,null,null,null,{"$f":"i_Settings!$B14","v":"Quarter 3"},{"$f":"MATCH(Y19,c_IndCalcs!$11:$11,0)-MATCH($Y$17,c_IndCalcs!$11:$11,0)","v":13},3,"",{"$f":"IF(U19=\"\",\"\",U19&\" Indicators of risk\")","v":"Quarter 3 Indicators of risk"},"ELL Status",{"$f":"IF(i_Settings!$G26=\"\",\"\",i_Settings!$G26)","v":"Cohort B"},"?1?"]
[null,null,null,null,null,null,null,null,null,null,null,null,null,null,null,null,null,null,null,null,{"$f":"i_Settings!$B15","v":"Quarter 4"},{"$f":"MATCH(Y20,c_IndCalcs!$11:$11,0)-MATCH($Y$17,c_IndCalcs!$11:$11,0)","v":19},4,"",{"$f":"IF(U20=\"\",\"\",U20&\" Indicators of risk\")","v":"Quarter 4 Indicators of risk"},"Disadvantaged",{"$f":"IF(i_Settings!$G27=\"\",\"\",i_Settings!$G27)","v":"Cohort C"},"??1"]
[null,null,null,null,null,null,null,null,null,null,null,null,null,null,null,null,null,null,null,null,"End of Year",{"$f":"MATCH(Y21,c_IndCalcs!$11:$11,0)-MATCH($Y$17,c_IndCalcs!$11:$11,0)","v":25},-1,null,"Year Total Indicators of Risk","Any",{"$f":"IF(i_Settings!$G28=\"\",\"\",i_Settings!$G28)","v":""},111]
[null,null,null,null,null,null,null,null,null,null,null,null,null,null,null,null,null,null,null,null,null,null,null,null,null,null,{"$f":"IF(i_Settings!$G29=\"\",\"\",i_Settings!$G29)","v":""}]
[null,null,null,null,null,null,null,null,null,null,null,null,null,null,null,null,null,null,null,null,null,null,null,null,null,null,{"$f":"IF(i_Settings!$G30=\"\",\"\",i_Settings!$G30)","v":""}]
[null,null,null,null,null,null,null,null,null,null,null,null,null,null,null,null,null,null,null,null,null,null,null,null,null,null,{"$f":"IF(i_Settings!$G31=\"\",\"\",i_Settings!$G31)","v":""}]
[null,null,null,null,null,null,null,null,null,null,null,null,null,null,null,null,null,null,null,null,null,null,null,null,null,null,{"$f":"IF(i_Settings!$G32=\"\",\"\",i_Settings!$G32)","v":""}]
[null,null,null,null,null,null,null,null,null,null,null,null,null,null,null,null,null,null,null,null,null,null,null,null,null,null,{"$f":"IF(i_Settings!$G33=\"\",\"\",i_Settings!$G33)","v":""}]
[null,null,null,null,null,null,null,null,null,null,null,null,null,null,null,null,null,null,null,null,null,null,null,null,null,null,{"$f":"IF(i_Settings!$G34=\"\",\"\",i_Settings!$G34)","v":""}]

{"sheet":"o_StudentDetail","index":22,"n_rows":39,"n_cols":17,"rows_kept":39,"cut":false,"hidden":false,"merged":[[30,5,30,6],[31,5,31,6],[24,4,24,5],[20,11,38,15],[19,4,20,5],[19,6,20,6],[19,7,20,7],[19,8,20,8],[19,9,20,9],[25,4,25,5],[38,5,38,6],[37,5,37,6],[33,5,33,6],[34,5,34,6],[35,5,35,6],[36,5,36,6],[11,6,11,7],[12,3,12,4],[13,3,13,4],[11,3,11,4],[15,8,15,9],[15,3,15,4],[13,6,13,7],[16,6,16,7],[23,4,23,5],[17,6,17,7],[15,6,15,7],[12,16,12,17],[14,6,14,7],[21,4,21,5],[22,4,22,5],[16,3,16,4],[14,3,14,4],[16,8,16,9],[17,8,17,9],[22,2,22,3],[11,12,11,13],[12,12,12,13],[10,8,10,9],[11,8,11,9],[12,8,12,9],[32,5,32,6],[3,11,6,15],[8,8,8,9],[28,5,28,6],[29,5,29,6],[3,2,4,9],[10,3,10,4],[23,2,23,3],[25,2,25,3],[24,2,24,3],[13,8,13,9],[14,8,14,9],[10,6,10,7],[12,6,12,7],[21,2,21,3],[10,12,10,13],[38,2,38,4],[28,2,28,4],[29,2,29,4],[30,2,30,4],[31,2,31,4],[32,2,32,4],[33,2,33,4],[34,2,34,4],[35,2,35,4],[36,2,36,4],[37,2,37,4]]}
[]
[]
[]
[null,null,"Detailed Student Report",null,null,null,null,null,null,null,null,"This report can be generated for each individual student and provides all information available in the tool for the selected student. Users can search by name or student ID to create a report for an individual student. Please refer to the 'More Info' button for additional information about this report."]
[]
[]
[]
[]
[null,null,"Student Details",null,null,null,null,"Date:",{"$f":"TODAY()","v":"2017-12-21"},null,null,"Search parameters"]
[null,null,null,null,null,null,null,null,null,null,null,null,null,null,null,null,"Don't remove:"]
[null,null,"ID:",{"$f":"IF($Q$12=1,OFFSET(i_StudentInfo!$D$13,MATCH($Q$11,INDIRECT(\"i_StudentInfo!$Y$14:$Y$5000\"),0),0),\"--\")","v":"--"},null,null,"Guardian(s):",null,{"$f":"IF($Q$12=1,IF(OFFSET(i_StudentInfo!$S$13,MATCH($Q$11,INDIRECT(\"i_StudentInfo!$Y$14:$Y$5000\"),0),0)=\"\",\"--\",OFFSET(i_StudentInfo!$S$13,MATCH($Q$11,INDIRECT(\"i_StudentInfo!$Y$14:$Y$5000\"),0),0)),\"--\")","v":"--"},null,null,"ID:",null,null,null,null,{"$f":"SrchID&SrchFName&SrchLName","v":""}]
[null,null,"First Name:",{"$f":"IF($Q$12=1,IF(OFFSET(i_StudentInfo!$B$13,MATCH($Q$11,INDIRECT(\"i_StudentInfo!$Y$14:$Y$5000\"),0),0)=\"\",\"--\",OFFSET(i_StudentInfo!$B$13,MATCH($Q$11,INDIRECT(\"i_StudentInfo!$Y$14:$Y$5000\"),0),0)),\"--\")","v":"--"},null,null,"Phone #:",null,{"$f":"IF($Q$12=1,IF(OFFSET(i_StudentInfo!$T$13,MATCH($Q$11,INDIRECT(\"i_StudentInfo!$Y$14:$Y$5000\"),0),0)=\"\",\"--\",OFFSET(i_StudentInfo!$T$13,MATCH($Q$11,INDIRECT(\"i_StudentInfo!$Y$14:$Y$5000\"),0),0)),\"--\")","v":"--"},null,null,"Last Name:",null,null,null,null,{"$f":"COUNTIF(i_StudentInfo!$Y:$Y,$Q$11)","v":1048575}]
[null,null,"Last Name:",{"$f":"IF($Q$12=1,IF(OFFSET(i_StudentInfo!$C$13,MATCH($Q$11,INDIRECT(\"i_StudentInfo!$Y$14:$Y$5000\"),0),0)=\"\",\"--\",OFFSET(i_StudentInfo!$C$13,MATCH($Q$11,INDIRECT(\"i_StudentInfo!$Y$14:$Y$5000\"),0),0)),\"--\")","v":"--"},null,null,"Email:",null,{"$f":"IF($Q$12=1,IF(OFFSET(i_StudentInfo!$U$13,MATCH($Q$11,INDIRECT(\"i_StudentInfo!$Y$14:$Y$5000\"),0),0)=\"\",\"--\",OFFSET(i_StudentInfo!$U$13,MATCH($Q$11,INDIRECT(\"i_StudentInfo!$Y$14:$Y$5000\"),0),0)),\"--\")","v":"--"},null,null,"First Name:",null,null,null,null,{"$f":"IF($Q$12=1,IF(OFFSET(i_StudentInfo!$F$13,MATCH($Q$11,INDIRECT(\"i_StudentInfo!$Y$14:$Y$5000\"),0),0)=\"\",\"--\",OFFSET(i_StudentInfo!$F$13,MATCH($Q$11,INDIRECT(\"i_StudentInfo!$Y$14:$Y$5000\"),0),0)),\"--\")","v":"--"}]
[null,null,"Current Age:",{"$f":"IF($Q$13=\"--\",\"--\",INT((TODAY()-Q13)/362.25))","v":"--"},null,null,"ELL status:",null,{"$f":"IF($Q$12=1,IF(OFFSET(i_StudentInfo!$K$13,MATCH($Q$11,INDIRECT(\"i_StudentInfo!$Y$14:$Y$5000\"),0),0)=\"\",\"--\",OFFSET(i_StudentInfo!$K$13,MATCH($Q$11,INDIRECT(\"i_StudentInfo!$Y$14:$Y$5000\"),0),0)),\"--\")","v":"--"},null,null,{"$f":"IF($Q$11=\"\",\"Please enter one or more seach parameters\",IF($Q$12=0,\"No students found\",IF($Q$12>1,\"Multiple students found, please refine your search parameters\",\"\")))","v":"Please enter one or more seach parameters"}]
[null,null,"Grade:",{"$f":"IF($Q$12=1,IF(OFFSET(i_StudentInfo!$E$13,MATCH($Q$11,INDIRECT(\"i_StudentInfo!$Y$14:$Y$5000\"),0),0)=\"\",\"--\",OFFSET(i_StudentInfo!$E$13,MATCH($Q$11,INDIRECT(\"i_StudentInfo!$Y$14:$Y$5000\"),0),0)),\"--\")","v":"--"},null,null,"Disadvantaged:",null,{"$f":"IF($Q$12=1,IF(OFFSET(i_StudentInfo!$J$13,MATCH($Q$11,INDIRECT(\"i_StudentInfo!$Y$14:$Y$5000\"),0),0)=\"\",\"--\",OFFSET(i_StudentInfo!$J$13,MATCH($Q$11,INDIRECT(\"i_StudentInfo!$Y$14:$Y$5000\"),0),0)),\"--\")","v":"--"}]
[null,null,"Race/Ethnicity:",{"$f":"IF($Q$12=1,IF(OFFSET(i_StudentInfo!$H$13,MATCH($Q$11,INDIRECT(\"i_StudentInfo!$Y$14:$Y$5000\"),0),0)=\"\",\"--\",OFFSET(i_StudentInfo!$H$13,MATCH($Q$11,INDIRECT(\"i_StudentInfo!$Y$14:$Y$5000\"),0),0)),\"--\")","v":"--"},null,null,"Cohort:",null,{"$f":"IF($Q$12=1,IF(OFFSET(i_StudentInfo!$L$13,MATCH($Q$11,INDIRECT(\"i_StudentInfo!$Y$14:$Y$5000\"),0),0)=\"\",\"--\",OFFSET(i_StudentInfo!$L$13,MATCH($Q$11,INDIRECT(\"i_StudentInfo!$Y$14:$Y$5000\"),0),0)),\"--\")","v":"--"}]
[null,null,"Disability:",{"$f":"IF($Q$12=1,IF(OFFSET(i_StudentInfo!$I$13,MATCH($Q$11,INDIRECT(\"i_StudentInfo!$Y$14:$Y$5000\"),0),0)=\"\",\"--\",OFFSET(i_StudentInfo!$I$13,MATCH($Q$11,INDIRECT(\"i_StudentInfo!$Y$14:$Y$5000\"),0),0)),\"--\")","v":"--"},null,null,"Enrollment Status:",null,{"$f":"IF($Q$12=1,IF(OFFSET(i_StudentInfo!$M$13,MATCH($Q$11,INDIRECT(\"i_StudentInfo!$Y$14:$Y$5000\"),0),0)=\"\",\"--\",OFFSET(i_StudentInfo!$M$13,MATCH($Q$11,INDIRECT(\"i_StudentInfo!$Y$14:$Y$5000\"),0),0)),\"--\")","v":"--"}]
[null,null,null,null,null,null,"Date of Change:",null,{"$f":"IF($Q$12=1,IF(OFFSET(i_StudentInfo!$N$13,MATCH($Q$11,INDIRECT(\"i_StudentInfo!$Y$14:$Y$5000\"),0),0)=\"\",\"--\",OFFSET(i_StudentInfo!$N$13,MATCH($Q$11,INDIRECT(\"i_StudentInfo!$Y$14:$Y$5000\"),0),0)),\"--\")","v":"--"}]
[null,null,"Flags"]
[null,null,"Incoming:",{"$f":"IF($Q$12=1,OFFSET(c_IndCalcs!$H$1,MATCH($D$11,c_IndCalcs!$D:$D,0)-1,0),\"--\")","v":"--"},{"$f":"i_Settings!B12","v":"Quarter 1"},null,{"$f":"i_Settings!B13","v":"Quarter 2"},{"$f":"i_Settings!B14","v":"Quarter 3"},{"$f":"i_Settings!B15","v":"Quarter 4"},"End of year",null,"Comments"]
[null,null,"Exam Performance:",{"$f":"IF($Q$12=1,OFFSET(c_IndCalcs!$I$1,MATCH($D$11,c_IndCalcs!$D:$D,0)-1,0),\"--\")","v":"--"},null,null,null,null,null,null,null,{"$f":"IF($Q$12=1,OFFSET(i_StudentInfo!$V$1,MATCH($D$11,i_StudentInfo!$D:$D,0)-1,0),\"\")","v":""}]
[null,null,{"$f":"\"First \"&EarlyAtt&\" Day Attendance:\"","v":"First 20 Day Attendance:"},null,{"$f":"IF($Q$12=1,OFFSET(c_IndCalcs!$K$1,MATCH($D$11,c_IndCalcs!$D:$D,0)-1,0),\"--\")","v":"--"},null,"--","--","--","--"]
[null,null,"Attendance:",null,{"$f":"IF($Q$12=1,OFFSET(c_IndCalcs!$L$1,MATCH($D$11,c_IndCalcs!$D:$D,0)-1,0),\"--\")","v":"--"},null,{"$f":"IF($Q$12=1,OFFSET(c_IndCalcs!$R$1,MATCH($D$11,c_IndCalcs!$D:$D,0)-1,0),\"--\")","v":"--"},{"$f":"IF($Q$12=1,OFFSET(c_IndCalcs!$X$1,MATCH($D$11,c_IndCalcs!$D:$D,0)-1,0),\"--\")","v":"--"},{"$f":"IF($Q$12=1,OFFSET(c_IndCalcs!$AD$1,MATCH($D$11,c_IndCalcs!$D:$D,0)-1,0),\"--\")","v":"--"},{"$f":"IF($Q$12=1,OFFSET(c_IndCalcs!$AJ$1,MATCH($D$11,c_IndCalcs!$D:$D,0)-1,0),\"--\")","v":"--"}]
[null,null,"English Course Failed:",null,{"$f":"IF($Q$12=1,OFFSET(c_IndCalcs!$M$1,MATCH($D$11,c_IndCalcs!$D:$D,0)-1,0),\"--\")","v":"--"},null,{"$f":"IF($Q$12=1,OFFSET(c_IndCalcs!$S$1,MATCH($D$11,c_IndCalcs!$D:$D,0)-1,0),\"--\")","v":"--"},{"$f":"IF($Q$12=1,OFFSET(c_IndCalcs!$Y$1,MATCH($D$11,c_IndCalcs!$D:$D,0)-1,0),\"--\")","v":"--"},{"$f":"IF($Q$12=1,OFFSET(c_IndCalcs!$AE$1,MATCH($D$11,c_IndCalcs!$D:$D,0)-1,0),\"--\")","v":"--"},{"$f":"IF($Q$12=1,OFFSET(c_IndCalcs!$AK$1,MATCH($D$11,c_IndCalcs!$D:$D,0)-1,0),\"--\")","v":"--"}]
[null,null,"Math Course Failed:",null,{"$f":"IF($Q$12=1,OFFSET(c_IndCalcs!$N$1,MATCH($D$11,c_IndCalcs!$D:$D,0)-1,0),\"--\")","v":"--"},null,{"$f":"IF($Q$12=1,OFFSET(c_IndCalcs!$T$1,MATCH($D$11,c_IndCalcs!$D:$D,0)-1,0),\"--\")","v":"--"},{"$f":"IF($Q$12=1,OFFSET(c_IndCalcs!$Z$1,MATCH($D$11,c_IndCalcs!$D:$D,0)-1,0),\"--\")","v":"--"},{"$f":"IF($Q$12=1,OFFSET(c_IndCalcs!$AF$1,MATCH($D$11,c_IndCalcs!$D:$D,0)-1,0),\"--\")","v":"--"},{"$f":"IF($Q$12=1,OFFSET(c_IndCalcs!$AL$1,MATCH($D$11,c_IndCalcs!$D:$D,0)-1,0),\"--\")","v":"--"}]
[null,null,"Behavior:",null,{"$f":"IF($Q$12=1,OFFSET(c_IndCalcs!$O$1,MATCH($D$11,c_IndCalcs!$D:$D,0)-1,0),\"--\")","v":"--"},null,{"$f":"IF($Q$12=1,OFFSET(c_IndCalcs!$U$1,MATCH($D$11,c_IndCalcs!$D:$D,0)-1,0),\"--\")","v":"--"},{"$f":"IF($Q$12=1,OFFSET(c_IndCalcs!$AA$1,MATCH($D$11,c_IndCalcs!$D:$D,0)-1,0),\"--\")","v":"--"},{"$f":"IF($Q$12=1,OFFSET(c_IndCalcs!$AG$1,MATCH($D$11,c_IndCalcs!$D:$D,0)-1,0),\"--\")","v":"--"},{"$f":"IF($Q$12=1,OFFSET(c_IndCalcs!$AM$1,MATCH($D$11,c_IndCalcs!$D:$D,0)-1,0),\"--\")","v":"--"}]
[]
[null,null,"Interventions"]
[{"$f":"MATCH(B30,i_Int!$U:$U,0)","v":{"$error":"#N/A"}},"Intervention ID","Intervention",null,null,"Type",null,"Tier","Start","End",null,null,null,null,null,null,"i_Int!$B1:$B10000"]
[{"$f":"MATCH(B31,i_Int!$U:$U,0)","v":{"$error":"#N/A"}},{"$f":"IF(ISERROR(MATCH($D$11,i_Int!$B:$B,0)),\"--\",INDEX(i_Int!$U:$U,MATCH($D$11,i_Int!$B:$B,0)))","v":"--"},{"$f":"IF($B30=\"--\",\"--\",INDEX(i_Int!$E:$E,MATCH($B30,i_Int!$U:$U,0)))","v":"--"},null,null,{"$f":"IF(OR($C30=0,$B30=\"--\"),\"--\",IF(VLOOKUP($C30,i_IntDesc!$B$12:$D$30,2,FALSE)=\"\",\"--\",VLOOKUP($C30,i_IntDesc!$B$12:$D$30,2,FALSE)))","v":"--"},null,{"$f":"IF(OR($C30=0,$B30=\"--\"),\"--\",IF(VLOOKUP($C30,i_IntDesc!$B$12:$D$30,3,FALSE)=\"\",\"--\",VLOOKUP($C30,i_IntDesc!$B$12:$D$30,3,FALSE)))","v":"--"},{"$f":"IF($B30=\"--\",\"--\",IF(INDEX(i_Int!$G:$G,MATCH($B30,i_Int!$U:$U,0))=\"\",\"--\",INDEX(i_Int!$G:$G,MATCH($B30,i_Int!$U:$U,0))))","v":"--"},{"$f":"IF($B30=\"--\",\"--\",IF(INDEX(i_Int!$H:$H,MATCH($B30,i_Int!$U:$U,0))=\"\",\"--\",INDEX(i_Int!$H:$H,MATCH($B30,i_Int!$U:$U,0))))","v":"--"},null,null,null,null,null,null,"i_Int!$U1:$U10000"]
[{"$f":"MATCH(B32,i_Int!$U:$U,0)","v":{"$error":"#N/A"}},{"$f":"IF(ISERROR(MATCH($D$11,OFFSET(INDIRECT($Q$29),$A29,0),0)),\"--\",INDEX(OFFSET(INDIRECT($Q$30),$A29,0),MATCH($D$11,OFFSET(INDIRECT($Q$29),$A29,0),0)))","v":"--"},{"$f":"IF($B31=\"--\",\"--\",INDEX(OFFSET(INDIRECT($Q$31),$A29,0),MATCH($B31,OFFSET(INDIRECT($Q$30),$A29,0),0)))","v":"--"},null,null,{"$f":"IF(OR($C31=0,$B31=\"--\"),\"--\",IF(VLOOKUP($C31,i_IntDesc!$B$12:$D$30,2,FALSE)=\"\",\"--\",VLOOKUP($C31,i_IntDesc!$B$12:$D$30,2,FALSE)))","v":"--"},null,{"$f":"IF(OR($C31=0,$B31=\"--\"),\"--\",IF(VLOOKUP($C31,i_IntDesc!$B$12:$D$30,3,FALSE)=\"\",\"--\",VLOOKUP($C31,i_IntDesc!$B$12:$D$30,3,FALSE)))","v":"--"},{"$f":"IF($B31=\"--\",\"--\",IF(INDEX(i_Int!$G:$G,MATCH($B31,i_Int!$U:$U,0))=\"\",\"--\",INDEX(i_Int!$G:$G,MATCH($B31,i_Int!$U:$U,0))))","v":"--"},{"$f":"IF($B31=\"--\",\"--\",IF(INDEX(i_Int!$H:$H,MATCH($B31,i_Int!$U:$U,0))=\"\",\"--\",INDEX(i_Int!$H:$H,MATCH($B31,i_Int!$U:$U,0))))","v":"--"},null,null,null,null,null,null,"i_Int!$E1:$E10000"]
[{"$f":"MATCH(B33,i_Int!$U:$U,0)","v":{"$error":"#N/A"}},"--","--",null,null,{"$f":"IF(OR($C32=0,$B32=\"--\"),\"--\",IF(VLOOKUP($C32,i_IntDesc!$B$12:$D$30,2,FALSE)=\"\",\"--\",VLOOKUP($C32,i_IntDesc!$B$12:$D$30,2,FALSE)))","v":"--"},null,{"$f":"IF(OR($C32=0,$B32=\"--\"),\"--\",IF(VLOOKUP($C32,i_IntDesc!$B$12:$D$30,3,FALSE)=\"\",\"--\",VLOOKUP($C32,i_IntDesc!$B$12:$D$30,3,FALSE)))","v":"--"},{"$f":"IF($B32=\"--\",\"--\",IF(INDEX(i_Int!$G:$G,MATCH($B32,i_Int!$U:$U,0))=\"\",\"--\",INDEX(i_Int!$G:$G,MATCH($B32,i_Int!$U:$U,0))))","v":"--"},{"$f":"IF($B32=\"--\",\"--\",IF(INDEX(i_Int!$H:$H,MATCH($B32,i_Int!$U:$U,0))=\"\",\"--\",INDEX(i_Int!$H:$H,MATCH($B32,i_Int!$U:$U,0))))","v":"--"}]
[{"$f":"MATCH(B34,i_Int!$U:$U,0)","v":{"$error":"#N/A"}},"--","--",null,null,{"$f":"IF(OR($C33=0,$B33=\"--\"),\"--\",IF(VLOOKUP($C33,i_IntDesc!$B$12:$D$30,2,FALSE)=\"\",\"--\",VLOOKUP($C33,i_IntDesc!$B$12:$D$30,2,FALSE)))","v":"--"},null,{"$f":"IF(OR($C33=0,$B33=\"--\"),\"--\",IF(VLOOKUP($C33,i_IntDesc!$B$12:$D$30,3,FALSE)=\"\",\"--\",VLOOKUP($C33,i_IntDesc!$B$12:$D$30,3,FALSE)))","v":"--"},{"$f":"IF($B33=\"--\",\"--\",IF(INDEX(i_Int!$G:$G,MATCH($B33,i_Int!$U:$U,0))=\"\",\"--\",INDEX(i_Int!$G:$G,MATCH($B33,i_Int!$U:$U,0))))","v":"--"},{"$f":"IF($B33=\"--\",\"--\",IF(INDEX(i_Int!$H:$H,MATCH($B33,i_Int!$U:$U,0))=\"\",\"--\",INDEX(i_Int!$H:$H,MATCH($B33,i_Int!$U:$U,0))))","v":"--"}]
[{"$f":"MATCH(B35,i_Int!$U:$U,0)","v":{"$error":"#N/A"}},"--","--",null,null,{"$f":"IF(OR($C34=0,$B34=\"--\"),\"--\",IF(VLOOKUP($C34,i_IntDesc!$B$12:$D$30,2,FALSE)=\"\",\"--\",VLOOKUP($C34,i_IntDesc!$B$12:$D$30,2,FALSE)))","v":"--"},null,{"$f":"IF(OR($C34=0,$B34=\"--\"),\"--\",IF(VLOOKUP($C34,i_IntDesc!$B$12:$D$30,3,FALSE)=\"\",\"--\",VLOOKUP($C34,i_IntDesc!$B$12:$D$30,3,FALSE)))","v":"--"},{"$f":"IF($B34=\"--\",\"--\",IF(INDEX(i_Int!$G:$G,MATCH($B34,i_Int!$U:$U,0))=\"\",\"--\",INDEX(i_Int!$G:$G,MATCH($B34,i_Int!$U:$U,0))))","v":"--"},{"$f":"IF($B34=\"--\",\"--\",IF(INDEX(i_Int!$H:$H,MATCH($B34,i_Int!$U:$U,0))=\"\",\"--\",INDEX(i_Int!$H:$H,MATCH($B34,i_Int!$U:$U,0))))","v":"--"}]
[{"$f":"MATCH(B36,i_Int!$U:$U,0)","v":{"$error":"#N/A"}},"--","--",null,null,{"$f":"IF(OR($C35=0,$B35=\"--\"),\"--\",IF(VLOOKUP($C35,i_IntDesc!$B$12:$D$30,2,FALSE)=\"\",\"--\",VLOOKUP($C35,i_IntDesc!$B$12:$D$30,2,FALSE)))","v":"--"},null,{"$f":"IF(OR($C35=0,$B35=\"--\"),\"--\",IF(VLOOKUP($C35,i_IntDesc!$B$12:$D$30,3,FALSE)=\"\",\"--\",VLOOKUP($C35,i_IntDesc!$B$12:$D$30,3,FALSE)))","v":"--"},{"$f":"IF($B35=\"--\",\"--\",IF(INDEX(i_Int!$G:$G,MATCH($B35,i_Int!$U:$U,0))=\"\",\"--\",INDEX(i_Int!$G:$G,MATCH($B35,i_Int!$U:$U,0))))","v":"--"},{"$f":"IF($B35=\"--\",\"--\",IF(INDEX(i_Int!$H:$H,MATCH($B35,i_Int!$U:$U,0))=\"\",\"--\",INDEX(i_Int!$H:$H,MATCH($B35,i_Int!$U:$U,0))))","v":"--"}]
[{"$f":"MATCH(B37,i_Int!$U:$U,0)","v":{"$error":"#N/A"}},"--","--",null,null,{"$f":"IF(OR($C36=0,$B36=\"--\"),\"--\",IF(VLOOKUP($C36,i_IntDesc!$B$12:$D$30,2,FALSE)=\"\",\"--\",VLOOKUP($C36,i_IntDesc!$B$12:$D$30,2,FALSE)))","v":"--"},null,{"$f":"IF(OR($C36=0,$B36=\"--\"),\"--\",IF(VLOOKUP($C36,i_IntDesc!$B$12:$D$30,3,FALSE)=\"\",\"--\",VLOOKUP($C36,i_IntDesc!$B$12:$D$30,3,FALSE)))","v":"--"},{"$f":"IF($B36=\"--\",\"--\",IF(INDEX(i_Int!$G:$G,MATCH($B36,i_Int!$U:$U,0))=\"\",\"--\",INDEX(i_Int!$G:$G,MATCH($B36,i_Int!$U:$U,0))))","v":"--"},{"$f":"IF($B36=\"--\",\"--\",IF(INDEX(i_Int!$H:$H,MATCH($B36,i_Int!$U:$U,0))=\"\",\"--\",INDEX(i_Int!$H:$H,MATCH($B36,i_Int!$U:$U,0))))","v":"--"}]
[{"$f":"MATCH(B38,i_Int!$U:$U,0)","v":{"$error":"#N/A"}},"--","--",null,null,{"$f":"IF(OR($C37=0,$B37=\"--\"),\"--\",IF(VLOOKUP($C37,i_IntDesc!$B$12:$D$30,2,FALSE)=\"\",\"--\",VLOOKUP($C37,i_IntDesc!$B$12:$D$30,2,FALSE)))","v":"--"},null,{"$f":"IF(OR($C37=0,$B37=\"--\"),\"--\",IF(VLOOKUP($C37,i_IntDesc!$B$12:$D$30,3,FALSE)=\"\",\"--\",VLOOKUP($C37,i_IntDesc!$B$12:$D$30,3,FALSE)))","v":"--"},{"$f":"IF($B37=\"--\",\"--\",IF(INDEX(i_Int!$G:$G,MATCH($B37,i_Int!$U:$U,0))=\"\",\"--\",INDEX(i_Int!$G:$G,MATCH($B37,i_Int!$U:$U,0))))","v":"--"},{"$f":"IF($B37=\"--\",\"--\",IF(INDEX(i_Int!$H:$H,MATCH($B37,i_Int!$U:$U,0))=\"\",\"--\",INDEX(i_Int!$H:$H,MATCH($B37,i_Int!$U:$U,0))))","v":"--"}]
[{"$f":"MATCH(B39,i_Int!$U:$U,0)","v":{"$error":"#N/A"}},"--","--",null,null,{"$f":"IF(OR($C38=0,$B38=\"--\"),\"--\",IF(VLOOKUP($C38,i_IntDesc!$B$12:$D$30,2,FALSE)=\"\",\"--\",VLOOKUP($C38,i_IntDesc!$B$12:$D$30,2,FALSE)))","v":"--"},null,{"$f":"IF(OR($C38=0,$B38=\"--\"),\"--\",IF(VLOOKUP($C38,i_IntDesc!$B$12:$D$30,3,FALSE)=\"\",\"--\",VLOOKUP($C38,i_IntDesc!$B$12:$D$30,3,FALSE)))","v":"--"},{"$f":"IF($B38=\"--\",\"--\",IF(INDEX(i_Int!$G:$G,MATCH($B38,i_Int!$U:$U,0))=\"\",\"--\",INDEX(i_Int!$G:$G,MATCH($B38,i_Int!$U:$U,0))))","v":"--"},{"$f":"IF($B38=\"--\",\"--\",IF(INDEX(i_Int!$H:$H,MATCH($B38,i_Int!$U:$U,0))=\"\",\"--\",INDEX(i_Int!$H:$H,MATCH($B38,i_Int!$U:$U,0))))","v":"--"}]
[null,"--","--",null,null,{"$f":"IF(OR($C39=0,$B39=\"--\"),\"--\",IF(VLOOKUP($C39,i_IntDesc!$B$12:$D$30,2,FALSE)=\"\",\"--\",VLOOKUP($C39,i_IntDesc!$B$12:$D$30,2,FALSE)))","v":"--"},null,{"$f":"IF(OR($C39=0,$B39=\"--\"),\"--\",IF(VLOOKUP($C39,i_IntDesc!$B$12:$D$30,3,FALSE)=\"\",\"--\",VLOOKUP($C39,i_IntDesc!$B$12:$D$30,3,FALSE)))","v":"--"},{"$f":"IF($B39=\"--\",\"--\",IF(INDEX(i_Int!$G:$G,MATCH($B39,i_Int!$U:$U,0))=\"\",\"--\",INDEX(i_Int!$G:$G,MATCH($B39,i_Int!$U:$U,0))))","v":"--"},{"$f":"IF($B39=\"--\",\"--\",IF(INDEX(i_Int!$H:$H,MATCH($B39,i_Int!$U:$U,0))=\"\",\"--\",INDEX(i_Int!$H:$H,MATCH($B39,i_Int!$U:$U,0))))","v":"--"}]

{"sheet":"o_StudentLevelRpt","index":23,"n_rows":19,"n_cols":29,"rows_kept":19,"cut":false,"hidden":false,"merged":[[9,5,9,7],[10,5,10,7],[3,1,4,8],[13,1,13,8],[11,2,11,3],[9,2,9,3],[12,2,12,3],[8,2,8,4],[8,5,8,7],[10,2,10,3]]}
[]
[]
[]
[null,"Student Level Report"]
[]
[]
[null,"Time Frame:",1,null,"Intervention:",1]
[]
[null,"Report:",{"$f":"INDEX(StuLvlRpts,StudentReportNumber)","v":"Custom report 1"},null,null,{"$f":"IF(INDEX(i_ReportFilters!$U:$U,MATCH($C$9,i_ReportFilters!$S:$S,0))=\"Yes\",INDEX(i_ReportFilters!$V:$V,MATCH($C$9,i_ReportFilters!$S:$S,0)),\"\")","v":""},null,null,{"$f":"IF(F9=\"\",\"\",INDEX(i_ReportFilters!$Y:$Y,MATCH($C$9,i_ReportFilters!$S:$S,0)))","v":""}]
[null,"Date:",{"$f":"TODAY()","v":"2017-12-21"},null,null,{"$f":"IF(INDEX(i_ReportFilters!$U:$U,MATCH($C$9,i_ReportFilters!$S:$S,0))=\"Yes\",INDEX(i_ReportFilters!$W:$W,MATCH($C$9,i_ReportFilters!$S:$S,0)),\"\")","v":""},null,null,{"$f":"IF(F10=\"\",\"\",i_ReportFilters!C21)","v":""}]
[null,"Cohort:",{"$f":"StudentRptCohort","v":"All"},null,null,{"$f":"IF(INDEX(i_ReportFilters!$U:$U,MATCH($C$9,i_ReportFilters!$S:$S,0))=\"Yes\",INDEX(i_ReportFilters!$X:$X,MATCH($C$9,i_ReportFilters!$S:$S,0)),\"\")","v":""},null,null,{"$f":"IF(F11=\"\",\"\",IF(I9=0,0,I10/I9))","v":""}]
[null,{"$f":"IF(INDEX(OFFSET(StuLvlRpts,0,1),StudentReportNumber)=\"Yes\",\"Time Frame:\",\"\")","v":"Time Frame:"},{"$f":"IF($B$12<>\"\",INDEX(i_ReportFilters!$AC$5:$AC$10,StudentReportTime),\"\")","v":"Quarter 1"}]
[null,{"$f":"IF(INDEX(StuLvlRpts,i_ReportFilters!$B$13)=\"Intervention report\",\"Intervention:\",\"\")","v":""},{"$f":"IF($B$13<>\"\",INDEX(CurrInterventions,i_ReportFilters!$D$13),\"\")","v":""}]
[null,{"$f":"IF(INDEX(OFFSET(StuLvlRpts,0,7),StudentReportNumber)=\"\",\"\",INDEX(OFFSET(StuLvlRpts,0,7),StudentReportNumber))","v":"This report can be customized to include any data fields that you select in the Custom Reports menu."}]
[null,{"$f":"IF(OR(B17=\"\",B17=0),\"\",INDEX(FieldNames!$D:$D,MATCH(B17,FieldNames!$A:$A,0)))","v":0},{"$f":"IF(OR(C17=\"\",C17=0),\"\",INDEX(FieldNames!$D:$D,MATCH(C17,FieldNames!$A:$A,0)))","v":0},{"$f":"IF(OR(D17=\"\",D17=0),\"\",INDEX(FieldNames!$D:$D,MATCH(D17,FieldNames!$A:$A,0)))","v":""},{"$f":"IF(OR(E17=\"\",E17=0),\"\",INDEX(FieldNames!$D:$D,MATCH(E17,FieldNames!$A:$A,0)))","v":""},{"$f":"IF(OR(F17=\"\",F17=0),\"\",INDEX(FieldNames!$D:$D,MATCH(F17,FieldNames!$A:$A,0)))","v":""},{"$f":"IF(OR(G17=\"\",G17=0),\"\",INDEX(FieldNames!$D:$D,MATCH(G17,FieldNames!$A:$A,0)))","v":""},{"$f":"IF(OR(H17=\"\",H17=0),\"\",INDEX(FieldNames!$D:$D,MATCH(H17,FieldNames!$A:$A,0)))","v":""},{"$f":"IF(OR(I17=\"\",I17=0),\"\",INDEX(FieldNames!$D:$D,MATCH(I17,FieldNames!$A:$A,0)))","v":""},{"$f":"IF(OR(J17=\"\",J17=0),\"\",INDEX(FieldNames!$D:$D,MATCH(J17,FieldNames!$A:$A,0)))","v":""},{"$f":"IF(OR(K17=\"\",K17=0),\"\",INDEX(FieldNames!$D:$D,MATCH(K17,FieldNames!$A:$A,0)))","v":""},{"$f":"IF(OR(L17=\"\",L17=0),\"\",INDEX(FieldNames!$D:$D,MATCH(L17,FieldNames!$A:$A,0)))","v":""},{"$f":"IF(OR(M17=\"\",M17=0),\"\",INDEX(FieldNames!$D:$D,MATCH(M17,FieldNames!$A:$A,0)))","v":""},{"$f":"IF(OR(N17=\"\",N17=0),\"\",INDEX(FieldNames!$D:$D,MATCH(N17,FieldNames!$A:$A,0)))","v":""},{"$f":"IF(OR(O17=\"\",O17=0),\"\",INDEX(FieldNames!$D:$D,MATCH(O17,FieldNames!$A:$A,0)))","v":""},{"$f":"IF(OR(P17=\"\",P17=0),\"\",INDEX(FieldNames!$D:$D,MATCH(P17,FieldNames!$A:$A,0)))","v":""},{"$f":"IF(OR(Q17=\"\",Q17=0),\"\",INDEX(FieldNames!$D:$D,MATCH(Q17,FieldNames!$A:$A,0)))","v":""},{"$f":"IF(OR(R17=\"\",R17=0),\"\",INDEX(FieldNames!$D:$D,MATCH(R17,FieldNames!$A:$A,0)))","v":""},{"$f":"IF(OR(S17=\"\",S17=0),\"\",INDEX(FieldNames!$D:$D,MATCH(S17,FieldNames!$A:$A,0)))","v":""},{"$f":"IF(OR(T17=\"\",T17=0),\"\",INDEX(FieldNames!$D:$D,MATCH(T17,FieldNames!$A:$A,0)))","v":""},{"$f":"IF(OR(U17=\"\",U17=0),\"\",INDEX(FieldNames!$D:$D,MATCH(U17,FieldNames!$A:$A,0)))","v":""},{"$f":"IF(OR(V17=\"\",V17=0),\"\",INDEX(FieldNames!$D:$D,MATCH(V17,FieldNames!$A:$A,0)))","v":""},{"$f":"IF(OR(W17=\"\",W17=0),\"\",INDEX(FieldNames!$D:$D,MATCH(W17,FieldNames!$A:$A,0)))","v":""},{"$f":"IF(OR(X17=\"\",X17=0),\"\",INDEX(FieldNames!$D:$D,MATCH(X17,FieldNames!$A:$A,0)))","v":""},{"$f":"IF(OR(Y17=\"\",Y17=0),\"\",INDEX(FieldNames!$D:$D,MATCH(Y17,FieldNames!$A:$A,0)))","v":""},{"$f":"IF(OR(Z17=\"\",Z17=0),\"\",INDEX(FieldNames!$D:$D,MATCH(Z17,FieldNames!$A:$A,0)))","v":""},{"$f":"IF(OR(AA17=\"\",AA17=0),\"\",INDEX(FieldNames!$D:$D,MATCH(AA17,FieldNames!$A:$A,0)))","v":""},{"$f":"IF(OR(AB17=\"\",AB17=0),\"\",INDEX(FieldNames!$D:$D,MATCH(AB17,FieldNames!$A:$A,0)))","v":""},{"$f":"IF(OR(AC17=\"\",AC17=0),\"\",INDEX(FieldNames!$D:$D,MATCH(AC17,FieldNames!$A:$A,0)))","v":""}]
[null,{"$f":"IF(INDEX(OFFSET(StuLvlRpts,0,8),MATCH($C$9,StuLvlRpts,0))=\"Yes\",IF(B15=\"Flag\",SUM(B19:B10001),\"\"),\"\")","v":""},"","","","","","","","","","","","","","","","","","","","","","","","",""]
[null,{"$f":"INDEX(i_StudentReportFields!C:C,MATCH(i_ReportFilters!$S$3,i_StudentReportFields!$B:$B,0))","v":"First Name"},{"$f":"INDEX(i_StudentReportFields!D:D,MATCH(i_ReportFilters!$S$3,i_StudentReportFields!$B:$B,0))","v":"DOB"},{"$f":"INDEX(i_StudentReportFields!E:E,MATCH(i_ReportFilters!$S$3,i_StudentReportFields!$B:$B,0))","v":0},{"$f":"INDEX(i_StudentReportFields!F:F,MATCH(i_ReportFilters!$S$3,i_StudentReportFields!$B:$B,0))","v":0},{"$f":"INDEX(i_StudentReportFields!G:G,MATCH(i_ReportFilters!$S$3,i_StudentReportFields!$B:$B,0))","v":0},{"$f":"INDEX(i_StudentReportFields!H:H,MATCH(i_ReportFilters!$S$3,i_StudentReportFields!$B:$B,0))","v":0},{"$f":"INDEX(i_StudentReportFields!I:I,MATCH(i_ReportFilters!$S$3,i_StudentReportFields!$B:$B,0))","v":0},{"$f":"INDEX(i_StudentReportFields!J:J,MATCH(i_ReportFilters!$S$3,i_StudentReportFields!$B:$B,0))","v":0},{"$f":"INDEX(i_StudentReportFields!K:K,MATCH(i_ReportFilters!$S$3,i_StudentReportFields!$B:$B,0))","v":0},{"$f":"INDEX(i_StudentReportFields!L:L,MATCH(i_ReportFilters!$S$3,i_StudentReportFields!$B:$B,0))","v":0},{"$f":"INDEX(i_StudentReportFields!M:M,MATCH(i_ReportFilters!$S$3,i_StudentReportFields!$B:$B,0))","v":0},{"$f":"INDEX(i_StudentReportFields!N:N,MATCH(i_ReportFilters!$S$3,i_StudentReportFields!$B:$B,0))","v":0},{"$f":"INDEX(i_StudentReportFields!O:O,MATCH(i_ReportFilters!$S$3,i_StudentReportFields!$B:$B,0))","v":0},{"$f":"INDEX(i_StudentReportFields!P:P,MATCH(i_ReportFilters!$S$3,i_StudentReportFields!$B:$B,0))","v":0},{"$f":"INDEX(i_StudentReportFields!Q:Q,MATCH(i_ReportFilters!$S$3,i_StudentReportFields!$B:$B,0))","v":0},{"$f":"INDEX(i_StudentReportFields!R:R,MATCH(i_ReportFilters!$S$3,i_StudentReportFields!$B:$B,0))","v":0},{"$f":"INDEX(i_StudentReportFields!S:S,MATCH(i_ReportFilters!$S$3,i_StudentReportFields!$B:$B,0))","v":0},{"$f":"INDEX(i_StudentReportFields!T:T,MATCH(i_ReportFilters!$S$3,i_StudentReportFields!$B:$B,0))","v":0},{"$f":"INDEX(i_StudentReportFields!U:U,MATCH(i_ReportFilters!$S$3,i_StudentReportFields!$B:$B,0))","v":0},{"$f":"INDEX(i_StudentReportFields!V:V,MATCH(i_ReportFilters!$S$3,i_StudentReportFields!$B:$B,0))","v":0},{"$f":"INDEX(i_StudentReportFields!W:W,MATCH(i_ReportFilters!$S$3,i_StudentReportFields!$B:$B,0))","v":0},{"$f":"INDEX(i_StudentReportFields!X:X,MATCH(i_ReportFilters!$S$3,i_StudentReportFields!$B:$B,0))","v":0},{"$f":"INDEX(i_StudentReportFields!Y:Y,MATCH(i_ReportFilters!$S$3,i_StudentReportFields!$B:$B,0))","v":0},{"$f":"INDEX(i_StudentReportFields!Z:Z,MATCH(i_ReportFilters!$S$3,i_StudentReportFields!$B:$B,0))","v":0},{"$f":"INDEX(i_StudentReportFields!AA:AA,MATCH(i_ReportFilters!$S$3,i_StudentReportFields!$B:$B,0))","v":0},{"$f":"INDEX(i_StudentReportFields!AB:AB,MATCH(i_ReportFilters!$S$3,i_StudentReportFields!$B:$B,0))","v":0}]
[null,{"$f":"IF(OR(B17=\"\",B17=0),\"\",INDEX(FieldNames!$E:$E,MATCH(B17,FieldNames!$A:$A,0)))","v":"First Name"},{"$f":"IF(OR(C17=\"\",C17=0),\"\",INDEX(FieldNames!$E:$E,MATCH(C17,FieldNames!$A:$A,0)))","v":"Date of Birth"},{"$f":"IF(OR(D17=\"\",D17=0),\"\",INDEX(FieldNames!$E:$E,MATCH(D17,FieldNames!$A:$A,0)))","v":""},{"$f":"IF(OR(E17=\"\",E17=0),\"\",INDEX(FieldNames!$E:$E,MATCH(E17,FieldNames!$A:$A,0)))","v":""},{"$f":"IF(OR(F17=\"\",F17=0),\"\",INDEX(FieldNames!$E:$E,MATCH(F17,FieldNames!$A:$A,0)))","v":""},{"$f":"IF(OR(G17=\"\",G17=0),\"\",INDEX(FieldNames!$E:$E,MATCH(G17,FieldNames!$A:$A,0)))","v":""},{"$f":"IF(OR(H17=\"\",H17=0),\"\",INDEX(FieldNames!$E:$E,MATCH(H17,FieldNames!$A:$A,0)))","v":""},{"$f":"IF(OR(I17=\"\",I17=0),\"\",INDEX(FieldNames!$E:$E,MATCH(I17,FieldNames!$A:$A,0)))","v":""},{"$f":"IF(OR(J17=\"\",J17=0),\"\",INDEX(FieldNames!$E:$E,MATCH(J17,FieldNames!$A:$A,0)))","v":""},{"$f":"IF(OR(K17=\"\",K17=0),\"\",INDEX(FieldNames!$E:$E,MATCH(K17,FieldNames!$A:$A,0)))","v":""},{"$f":"IF(OR(L17=\"\",L17=0),\"\",INDEX(FieldNames!$E:$E,MATCH(L17,FieldNames!$A:$A,0)))","v":""},{"$f":"IF(OR(M17=\"\",M17=0),\"\",INDEX(FieldNames!$E:$E,MATCH(M17,FieldNames!$A:$A,0)))","v":""},{"$f":"IF(OR(N17=\"\",N17=0),\"\",INDEX(FieldNames!$E:$E,MATCH(N17,FieldNames!$A:$A,0)))","v":""},{"$f":"IF(OR(O17=\"\",O17=0),\"\",INDEX(FieldNames!$E:$E,MATCH(O17,FieldNames!$A:$A,0)))","v":""},{"$f":"IF(OR(P17=\"\",P17=0),\"\",INDEX(FieldNames!$E:$E,MATCH(P17,FieldNames!$A:$A,0)))","v":""},{"$f":"IF(OR(Q17=\"\",Q17=0),\"\",INDEX(FieldNames!$E:$E,MATCH(Q17,FieldNames!$A:$A,0)))","v":""},{"$f":"IF(OR(R17=\"\",R17=0),\"\",INDEX(FieldNames!$E:$E,MATCH(R17,FieldNames!$A:$A,0)))","v":""},{"$f":"IF(OR(S17=\"\",S17=0),\"\",INDEX(FieldNames!$E:$E,MATCH(S17,FieldNames!$A:$A,0)))","v":""},{"$f":"IF(OR(T17=\"\",T17=0),\"\",INDEX(FieldNames!$E:$E,MATCH(T17,FieldNames!$A:$A,0)))","v":""},{"$f":"IF(OR(U17=\"\",U17=0),\"\",INDEX(FieldNames!$E:$E,MATCH(U17,FieldNames!$A:$A,0)))","v":""},{"$f":"IF(OR(V17=\"\",V17=0),\"\",INDEX(FieldNames!$E:$E,MATCH(V17,FieldNames!$A:$A,0)))","v":""},{"$f":"IF(OR(W17=\"\",W17=0),\"\",INDEX(FieldNames!$E:$E,MATCH(W17,FieldNames!$A:$A,0)))","v":""},{"$f":"IF(OR(X17=\"\",X17=0),\"\",INDEX(FieldNames!$E:$E,MATCH(X17,FieldNames!$A:$A,0)))","v":""},{"$f":"IF(OR(Y17=\"\",Y17=0),\"\",INDEX(FieldNames!$E:$E,MATCH(Y17,FieldNames!$A:$A,0)))","v":""},{"$f":"IF(OR(Z17=\"\",Z17=0),\"\",INDEX(FieldNames!$E:$E,MATCH(Z17,FieldNames!$A:$A,0)))","v":""},{"$f":"IF(OR(AA17=\"\",AA17=0),\"\",INDEX(FieldNames!$E:$E,MATCH(AA17,FieldNames!$A:$A,0)))","v":""}]
[{"$f":"IF(c_ReportData!DF13=\"\",\"\",c_ReportData!DF13)","v":""},{"$f":"IF(OR($A19=\"\",B$17=0,B$17=\"\"),\"\",INDEX(AllData,MATCH($A19,StudentIDs,0)+1,MATCH(B$17,c_ReportData!$12:$12,0)))","v":""},{"$f":"IF(OR($A19=\"\",C$17=0,C$17=\"\"),\"\",INDEX(AllData,MATCH($A19,StudentIDs,0)+1,MATCH(C$17,c_ReportData!$12:$12,0)))","v":""},{"$f":"IF(OR($A19=\"\",D$17=0,D$17=\"\"),\"\",INDEX(AllData,MATCH($A19,StudentIDs,0)+1,MATCH(D$17,c_ReportData!$12:$12,0)))","v":""},{"$f":"IF(OR($A19=\"\",E$17=0,E$17=\"\"),\"\",INDEX(AllData,MATCH($A19,StudentIDs,0)+1,MATCH(E$17,c_ReportData!$12:$12,0)))","v":""},{"$f":"IF(OR($A19=\"\",F$17=0,F$17=\"\"),\"\",INDEX(AllData,MATCH($A19,StudentIDs,0)+1,MATCH(F$17,c_ReportData!$12:$12,0)))","v":""},{"$f":"IF(OR($A19=\"\",G$17=0,G$17=\"\"),\"\",INDEX(AllData,MATCH($A19,StudentIDs,0)+1,MATCH(G$17,c_ReportData!$12:$12,0)))","v":""},{"$f":"IF(OR($A19=\"\",H$17=0,H$17=\"\"),\"\",INDEX(AllData,MATCH($A19,StudentIDs,0)+1,MATCH(H$17,c_ReportData!$12:$12,0)))","v":""},{"$f":"IF(OR($A19=\"\",I$17=0,I$17=\"\"),\"\",INDEX(AllData,MATCH($A19,StudentIDs,0)+1,MATCH(I$17,c_ReportData!$12:$12,0)))","v":""},{"$f":"IF(OR($A19=\"\",J$17=0,J$17=\"\"),\"\",INDEX(AllData,MATCH($A19,StudentIDs,0)+1,MATCH(J$17,c_ReportData!$12:$12,0)))","v":""},{"$f":"IF(OR($A19=\"\",K$17=0,K$17=\"\"),\"\",INDEX(AllData,MATCH($A19,StudentIDs,0)+1,MATCH(K$17,c_ReportData!$12:$12,0)))","v":""},{"$f":"IF(OR($A19=\"\",L$17=0,L$17=\"\"),\"\",INDEX(AllData,MATCH($A19,StudentIDs,0)+1,MATCH(L$17,c_ReportData!$12:$12,0)))","v":""},{"$f":"IF(OR($A19=\"\",M$17=0,M$17=\"\"),\"\",INDEX(AllData,MATCH($A19,StudentIDs,0)+1,MATCH(M$17,c_ReportData!$12:$12,0)))","v":""},{"$f":"IF(OR($A19=\"\",N$17=0,N$17=\"\"),\"\",INDEX(AllData,MATCH($A19,StudentIDs,0)+1,MATCH(N$17,c_ReportData!$12:$12,0)))","v":""},{"$f":"IF(OR($A19=\"\",O$17=0,O$17=\"\"),\"\",INDEX(AllData,MATCH($A19,StudentIDs,0)+1,MATCH(O$17,c_ReportData!$12:$12,0)))","v":""},{"$f":"IF(OR($A19=\"\",P$17=0,P$17=\"\"),\"\",INDEX(AllData,MATCH($A19,StudentIDs,0)+1,MATCH(P$17,c_ReportData!$12:$12,0)))","v":""},{"$f":"IF(OR($A19=\"\",Q$17=0,Q$17=\"\"),\"\",INDEX(AllData,MATCH($A19,StudentIDs,0)+1,MATCH(Q$17,c_ReportData!$12:$12,0)))","v":""},{"$f":"IF(OR($A19=\"\",R$17=0,R$17=\"\"),\"\",INDEX(AllData,MATCH($A19,StudentIDs,0)+1,MATCH(R$17,c_ReportData!$12:$12,0)))","v":""},{"$f":"IF(OR($A19=\"\",S$17=0,S$17=\"\"),\"\",INDEX(AllData,MATCH($A19,StudentIDs,0)+1,MATCH(S$17,c_ReportData!$12:$12,0)))","v":""},{"$f":"IF(OR($A19=\"\",T$17=0,T$17=\"\"),\"\",INDEX(AllData,MATCH($A19,StudentIDs,0)+1,MATCH(T$17,c_ReportData!$12:$12,0)))","v":""},{"$f":"IF(OR($A19=\"\",U$17=0,U$17=\"\"),\"\",INDEX(AllData,MATCH($A19,StudentIDs,0)+1,MATCH(U$17,c_ReportData!$12:$12,0)))","v":""},{"$f":"IF(OR($A19=\"\",V$17=0,V$17=\"\"),\"\",INDEX(AllData,MATCH($A19,StudentIDs,0)+1,MATCH(V$17,c_ReportData!$12:$12,0)))","v":""},{"$f":"IF(OR($A19=\"\",W$17=0,W$17=\"\"),\"\",INDEX(AllData,MATCH($A19,StudentIDs,0)+1,MATCH(W$17,c_ReportData!$12:$12,0)))","v":""},{"$f":"IF(OR($A19=\"\",X$17=0,X$17=\"\"),\"\",INDEX(AllData,MATCH($A19,StudentIDs,0)+1,MATCH(X$17,c_ReportData!$12:$12,0)))","v":""},{"$f":"IF(OR($A19=\"\",Y$17=0,Y$17=\"\"),\"\",INDEX(AllData,MATCH($A19,StudentIDs,0)+1,MATCH(Y$17,c_ReportData!$12:$12,0)))","v":""},{"$f":"IF(OR($A19=\"\",Z$17=0,Z$17=\"\"),\"\",INDEX(AllData,MATCH($A19,StudentIDs,0)+1,MATCH(Z$17,c_ReportData!$12:$12,0)))","v":""},{"$f":"IF(OR($A19=\"\",AA$17=0,AA$17=\"\"),\"\",INDEX(AllData,MATCH($A19,StudentIDs,0)+1,MATCH(AA$17,c_ReportData!$12:$12,0)))","v":""},{"$f":"IF(OR($A19=\"\",AB$16=0,AB$16=\"\"),\"\",INDEX(AllData,MATCH($A19,StudentIDs,0)+1,MATCH(AB$16,c_ReportData!$12:$12,0)))","v":""},{"$f":"IF(OR($A19=\"\",AC$16=0,AC$16=\"\"),\"\",INDEX(AllData,MATCH($A19,StudentIDs,0)+1,MATCH(AC$16,c_ReportData!$12:$12,0)))","v":""}]

{"sheet":"o_SchSuccessRpt","index":24,"n_rows":33,"n_cols":30,"rows_kept":33,"cut":false,"hidden":false,"merged":[[20,1,20,3],[18,1,18,3],[3,1,4,11],[6,10,6,11],[9,1,12,11],[6,1,6,2],[17,1,17,3],[19,1,19,3],[7,3,7,6]]}
[]
[]
[]
[null,"Incoming Indicator of Risk Transition Report"]
[]
[null,null,null,null,null,null,null,null,null,null,null,null,null,null,null,null,null,null,null,null,null,null,{"$f":"COUNTA(C30:H30)-COUNTBLANK(C30:H30)","v":6},{"$f":"IF(D8=\"All\",\"*\",D8)","v":"*"}]
[null,"Time Frame:",null,1,null,null,"Filter:",2,null,"Date:",{"$f":"TODAY()","v":"2017-12-21"},null,null,null,null,null,null,null,null,null,"GP1_days","Yes",1,{"$f":"i_Settings!$B12","v":"Quarter 1"},"GP1_Any Flag",{"$f":"\"GP1_First \"&EarlyAtt&\" Day Attendance\"","v":"GP1_First 20 Day Attendance"},"GP1_Attendance","GP1_EngCourseFail","GP1_MathCourseFail","GP1_Behavior"]
[null,"Cohort:",null,{"$f":"SchoolRptCohort","v":"All"},null,null,null,null,null,null,null,null,null,null,null,null,null,null,null,null,"GP2_days","No",2,{"$f":"i_Settings!$B13","v":"Quarter 2"},"GP2_Any Flag","GP2_Attendance","GP2_EngCourseFail","GP2_MathCourseFail","GP2_Behavior"]
[null,null,null,null,null,null,null,null,null,null,null,null,null,null,null,null,null,null,null,null,"GP3_days",null,3,{"$f":"i_Settings!$B14","v":"Quarter 3"},"GP3_Any Flag","GP3_Attendance","GP3_EngCourseFail","GP3_MathCourseFail","GP3_Behavior"]
[null,"This report shows information about students who were flagged and not flagged as at risk upon entry to high school. The top graph shows the number and percentage of pre-high school flagged and not flagged students who were enrolled (including transferred in), transferred out or graduated, or dropped out. The bottom graph shows the number and percentage of pre-high school flagged and not flagged students who were flagged for each indicator of risk for the selected grading period or time frame.  Please refer to the 'More Info' button for additional information about this report.",null,null,null,null,null,null,null,null,null,null,null,null,null,null,null,null,null,null,"GP4_days",null,4,{"$f":"i_Settings!$B15","v":"Quarter 4"},"GP4_Any Flag","GP4_Attendance","GP4_EngCourseFail","GP4_MathCourseFail","GP4_Behavior"]
[null,null,null,null,null,null,null,null,null,null,null,null,null,null,null,null,null,null,null,null,"EOY_status",null,5,"End of year","eoy_Any flag","eoy_Attendance","eoy_EngCourseFail","eoy_MathCourseFail","eoy_Behavior"]
[]
[]
[]
[null,null,null,null,null,null,null,null,"Enrolled","Transferred Out","Dropped Out",null,null,"Dropped Out",1,2,3,4,"eoy"]
[null,null,null,null,null,null,null,null,"Enrolled","Transferred Out","Dropped Out",null,null,"Incoming Flagged",{"$f":"SUMPRODUCT((DropOutStatus=$N$15&O$15)*(PreHSReportData=$A31)*(IF($H$7=1,SchoolReportFilter,1))*(CohortReport=1))","v":0},0,0,0,{"$f":"SUM(O16:R16)","v":0}]
[1,null,null,null,null,null,null,"Incoming Flagged",{"$f":"IF(INDEX($X$7:$X$11,$D$7)=\"\",0,SUM(IF($D$7=5,(ISNUMBER(EOY_status)),(INDIRECT(\"ArrGP\"&$D$7&\"_Days\")<>0))*(PreHSReportData=$A31)*(IF($H$7=1,SchoolReportFilter,1))*(CohortReport=1))-SUM(J17:K17))","v":0},{"$f":"IF(INDEX($AA$7:$AA$12,$D$7)=\"\",0,INDEX($O24:$S24,1,$D$7))","v":0},{"$f":"IF(INDEX($AA$7:$AA$12,$D$7)=\"\",0,INDEX($O16:$S16,1,$D$7))","v":0},null,null,"Incoming No Flag",0,0,0,0,{"$f":"SUM(O17:R17)","v":0}]
[0,"Total number of students:",null,null,{"$f":"SUM(IF($D$7=5,(EOY_status),(INDIRECT(\"ArrGP\"&$D$7&\"_Days\")<>0))*(CohortReport=1))","v":1},null,null,"Incoming No Flag",{"$f":"IF(INDEX($X$7:$X$11,$D$7)=\"\",0,SUM(IF($D$7=5,(ISNUMBER(EOY_status)),(INDIRECT(\"ArrGP\"&$D$7&\"_Days\")<>0))*(PreHSReportData=$A32)*(IF($H$7=1,SchoolReportFilter,1))*(CohortReport=1))-SUM(J18:K18))","v":0},{"$f":"IF(INDEX($AA$7:$AA$12,$D$7)=\"\",0,INDEX($O25:$S25,1,$D$7))","v":0},{"$f":"IF(INDEX($AA$7:$AA$12,$D$7)=\"\",0,INDEX($O17:$S17,1,$D$7))","v":0},null,null,"Incoming No Data",0,0,0,0,{"$f":"SUM(O18:R18)","v":0}]
[null,"Number of students with incoming status data:",null,null,{"$f":"SUM(ISNUMBER(PreHSReportData)*IF($D$7=5,(EOY_status),OFFSET(GraphicalOffset,0,MATCH(INDEX($U$7:$U$10,$D$7,0),c_ReportData!$12:$12,0)-1)<>0)*(CohortReport=1))","v":0},null,null,"Incoming No Data",{"$f":"IF(INDEX($X$7:$X$11,$D$7)=\"\",0,SUM(IF($D$7=5,(ISNUMBER(EOY_status)),(INDIRECT(\"ArrGP\"&$D$7&\"_Days\")<>0))*(PreHSReportData=$A33)*(IF($H$7=1,SchoolReportFilter,1))*(CohortReport=1))-SUM(J19:K19))","v":0},0,0,null,null,"Transferred In",1,2,3,4]
[null,"Number of students with incoming risk flag:",null,null,{"$f":"SUM((PreHSReportData=1)*IF($D$7=5,(EOY_status),(OFFSET(GraphicalOffset,0,MATCH(INDEX($U$7:$U$10,$D$7,0),c_ReportData!$12:$12,0)-1)<>0))*(CohortReport=1))","v":0},null,null,null,null,null,null,null,null,"Incoming Flagged",{"$f":"SUMPRODUCT((DropOutStatus=$N$19&O$19)*(PreHSReportData=$A31)*(IF($H$7=1,SchoolReportFilter,1))*(CohortReport=1))","v":0},{"$f":"SUMPRODUCT((DropOutStatus=$N$19&P$19)*(PreHSReportData=$A39)*(IF($H$7=1,SchoolReportFilter,1))*(CohortReport=1))","v":0},0,0,{"$f":"SUM(O20:R20)","v":0}]
[null,"Number of students without incoming risk flag:",null,null,{"$f":"SUM((PreHSReportData=0)*IF($D$7=5,(EOY_status),(OFFSET(GraphicalOffset,0,MATCH(INDEX($U$7:$U$10,$D$7,0),c_ReportData!$12:$12,0)-1)<>0))*(CohortReport=1))","v":0},null,null,null,null,null,null,null,null,"Incoming No Flag",{"$f":"SUMPRODUCT((DropOutStatus=$N$19&O$19)*(PreHSReportData=$A32)*(IF($H$7=1,SchoolReportFilter,1))*(CohortReport=1))","v":0},0,0,0,{"$f":"SUM(O21:R21)","v":0}]
[0,null,null,null,null,null,null,null,null,null,null,null,null,"Incoming No Data",{"$f":"SUMPRODUCT((DropOutStatus=$N$19&O$19)*(PreHSReportData=$A33)*(IF($H$7=1,SchoolReportFilter,1))*(CohortReport=1))","v":0},0,0,0,{"$f":"SUM(O22:R22)","v":0}]
[null,null,null,null,null,null,null,null,null,null,null,null,null,"Transferred Out",1,2,3,4]
[null,null,null,null,null,null,null,null,null,null,null,null,null,"Incoming Flagged",{"$f":"SUMPRODUCT((DropOutStatus=$N$23&O$23)*(PreHSReportData=$A31)*(IF($H$7=1,SchoolReportFilter,1))*(CohortReport=1))","v":0},0,0,0,{"$f":"SUM(O24:R24)","v":0}]
[null,null,null,null,null,null,null,null,null,null,null,null,null,"Incoming No Flag",0,0,0,0,{"$f":"SUM(O25:R25)","v":0}]
[null,null,null,null,null,null,null,null,null,null,null,null,null,"Incoming No Data",0,0,0,0,{"$f":"SUM(O26:R26)","v":0}]
[]
[]
[null,null,{"$f":"IF(INDEX($X$7:$X$11,$D$7)=\"\",\"n/a\",INDEX(Y$7:Y$11,MATCH($D$7,$W$7:$W$11,0)))","v":"GP1_Any Flag"},{"$f":"IF(INDEX($X$7:$X$11,$D$7)=\"\",\"n/a\",INDEX(Z$7:Z$11,MATCH($D$7,$W$7:$W$11,0)))","v":"GP1_First 20 Day Attendance"},"GP1_Attendance","GP1_EngCourseFail","GP1_MathCourseFail","GP1_Behavior"]
[null,null,{"$f":"IF(C29=\"n/a\",C29,IF(C29=0,\"\",INDEX(FieldNames!$E:$E,MATCH(C29,FieldNames!$A:$A,0))))","v":"Quarter 1 Any Flag"},{"$f":"IF(D29=\"n/a\",D29,IF(D29=0,\"\",INDEX(FieldNames!$E:$E,MATCH(D29,FieldNames!$A:$A,0))))","v":"Quarter 1 First 20 Day Attendance Flag"},{"$f":"IF(E29=\"n/a\",E29,IF(E29=0,\"\",INDEX(FieldNames!$E:$E,MATCH(E29,FieldNames!$A:$A,0))))","v":"Quarter 1 Attendance Flag"},{"$f":"IF(F29=\"n/a\",F29,IF(F29=0,\"\",INDEX(FieldNames!$E:$E,MATCH(F29,FieldNames!$A:$A,0))))","v":"Quarter 1 English Course Fail Flag"},{"$f":"IF(G29=\"n/a\",G29,IF(G29=0,\"\",INDEX(FieldNames!$E:$E,MATCH(G29,FieldNames!$A:$A,0))))","v":"Quarter 1 Math Course Fail Flag"},{"$f":"IF(H29=\"n/a\",H29,IF(H29=0,\"\",INDEX(FieldNames!$E:$E,MATCH(H29,FieldNames!$A:$A,0))))","v":"Quarter 1 Behavior Flag"}]
[1,"Incoming Flagged",{"$f":"IF(INDEX($AA$7:$AA$12,$D$7)=\"\",0,IF(C$29=0,\"\",SUMPRODUCT((IF($H$7=1,SchoolReportFilter,1))*(OFFSET(GraphicalOffset,0,MATCH(C$29,c_ReportData!$12:$12,0)-1)=IF(C$30=\"No flag\",0,1))*(PreHSReportData=$A31)*(CohortReport=1))))","v":0},{"$f":"IF(INDEX($AA$7:$AA$12,$D$7)=\"\",0,IF(D$29=0,\"\",SUMPRODUCT((IF($H$7=1,SchoolReportFilter,1))*(OFFSET(GraphicalOffset,0,MATCH(D$29,c_ReportData!$12:$12,0)-1)=IF(D$30=\"No flag\",0,1))*(PreHSReportData=$A31)*(CohortReport=1))))","v":0},{"$f":"IF(INDEX($AA$7:$AA$12,$D$7)=\"\",0,IF(E$29=0,\"\",SUMPRODUCT((IF($H$7=1,SchoolReportFilter,1))*(OFFSET(GraphicalOffset,0,MATCH(E$29,c_ReportData!$12:$12,0)-1)=IF(E$30=\"No flag\",0,1))*(PreHSReportData=$A31)*(CohortReport=1))))","v":0},{"$f":"IF(INDEX($AA$7:$AA$12,$D$7)=\"\",0,IF(F$29=0,\"\",SUMPRODUCT((IF($H$7=1,SchoolReportFilter,1))*(OFFSET(GraphicalOffset,0,MATCH(F$29,c_ReportData!$12:$12,0)-1)=IF(F$30=\"No flag\",0,1))*(PreHSReportData=$A31)*(CohortReport=1))))","v":0},{"$f":"IF(INDEX($AA$7:$AA$12,$D$7)=\"\",0,IF(G$29=0,\"\",SUMPRODUCT((IF($H$7=1,SchoolReportFilter,1))*(OFFSET(GraphicalOffset,0,MATCH(G$29,c_ReportData!$12:$12,0)-1)=IF(G$30=\"No flag\",0,1))*(PreHSReportData=$A31)*(CohortReport=1))))","v":0},{"$f":"IF(INDEX($AA$7:$AA$12,$D$7)=\"\",0,IF(H$29=0,\"\",SUMPRODUCT((IF($H$7=1,SchoolReportFilter,1))*(OFFSET(GraphicalOffset,0,MATCH(H$29,c_ReportData!$12:$12,0)-1)=IF(H$30=\"No flag\",0,1))*(PreHSReportData=$A31)*(CohortReport=1))))","v":0}]
[0,"Incoming No Flag",{"$f":"IF(INDEX($AA$7:$AA$12,$D$7)=\"\",0,IF(C$29=0,\"\",SUMPRODUCT((IF($H$7=1,SchoolReportFilter,1))*(OFFSET(GraphicalOffset,0,MATCH(C$29,c_ReportData!$12:$12,0)-1)=IF(C$30=\"No flag\",0,1))*(PreHSReportData=$A32)*(CohortReport=1))))","v":0},{"$f":"IF(INDEX($AA$7:$AA$12,$D$7)=\"\",0,IF(D$29=0,\"\",SUMPRODUCT((IF($H$7=1,SchoolReportFilter,1))*(OFFSET(GraphicalOffset,0,MATCH(D$29,c_ReportData!$12:$12,0)-1)=IF(D$30=\"No flag\",0,1))*(PreHSReportData=$A32)*(CohortReport=1))))","v":0},{"$f":"IF(INDEX($AA$7:$AA$12,$D$7)=\"\",0,IF(E$29=0,\"\",SUMPRODUCT((IF($H$7=1,SchoolReportFilter,1))*(OFFSET(GraphicalOffset,0,MATCH(E$29,c_ReportData!$12:$12,0)-1)=IF(E$30=\"No flag\",0,1))*(PreHSReportData=$A32)*(CohortReport=1))))","v":0},{"$f":"IF(INDEX($AA$7:$AA$12,$D$7)=\"\",0,IF(F$29=0,\"\",SUMPRODUCT((IF($H$7=1,SchoolReportFilter,1))*(OFFSET(GraphicalOffset,0,MATCH(F$29,c_ReportData!$12:$12,0)-1)=IF(F$30=\"No flag\",0,1))*(PreHSReportData=$A32)*(CohortReport=1))))","v":0},{"$f":"IF(INDEX($AA$7:$AA$12,$D$7)=\"\",0,IF(G$29=0,\"\",SUMPRODUCT((IF($H$7=1,SchoolReportFilter,1))*(OFFSET(GraphicalOffset,0,MATCH(G$29,c_ReportData!$12:$12,0)-1)=IF(G$30=\"No flag\",0,1))*(PreHSReportData=$A32)*(CohortReport=1))))","v":0},{"$f":"IF(INDEX($AA$7:$AA$12,$D$7)=\"\",0,IF(H$29=0,\"\",SUMPRODUCT((IF($H$7=1,SchoolReportFilter,1))*(OFFSET(GraphicalOffset,0,MATCH(H$29,c_ReportData!$12:$12,0)-1)=IF(H$30=\"No flag\",0,1))*(PreHSReportData=$A32)*(CohortReport=1))))","v":0}]
["--","Incoming No Data",{"$f":"IF(INDEX($AA$7:$AA$12,$D$7)=\"\",0,IF(C$29=0,\"\",SUMPRODUCT((IF($H$7=1,SchoolReportFilter,1))*(OFFSET(GraphicalOffset,0,MATCH(C$29,c_ReportData!$12:$12,0)-1)=IF(C$30=\"No flag\",0,1))*(PreHSReportData=$A33)*(CohortReport=1))))","v":0},{"$f":"IF(INDEX($AA$7:$AA$12,$D$7)=\"\",0,IF(D$29=0,\"\",SUMPRODUCT((IF($H$7=1,SchoolReportFilter,1))*(OFFSET(GraphicalOffset,0,MATCH(D$29,c_ReportData!$12:$12,0)-1)=IF(D$30=\"No flag\",0,1))*(PreHSReportData=$A33)*(CohortReport=1))))","v":0},{"$f":"IF(INDEX($AA$7:$AA$12,$D$7)=\"\",0,IF(E$29=0,\"\",SUMPRODUCT((IF($H$7=1,SchoolReportFilter,1))*(OFFSET(GraphicalOffset,0,MATCH(E$29,c_ReportData!$12:$12,0)-1)=IF(E$30=\"No flag\",0,1))*(PreHSReportData=$A33)*(CohortReport=1))))","v":0},{"$f":"IF(INDEX($AA$7:$AA$12,$D$7)=\"\",0,IF(F$29=0,\"\",SUMPRODUCT((IF($H$7=1,SchoolReportFilter,1))*(OFFSET(GraphicalOffset,0,MATCH(F$29,c_ReportData!$12:$12,0)-1)=IF(F$30=\"No flag\",0,1))*(PreHSReportData=$A33)*(CohortReport=1))))","v":0},{"$f":"IF(INDEX($AA$7:$AA$12,$D$7)=\"\",0,IF(G$29=0,\"\",SUMPRODUCT((IF($H$7=1,SchoolReportFilter,1))*(OFFSET(GraphicalOffset,0,MATCH(G$29,c_ReportData!$12:$12,0)-1)=IF(G$30=\"No flag\",0,1))*(PreHSReportData=$A33)*(CohortReport=1))))","v":0},{"$f":"IF(INDEX($AA$7:$AA$12,$D$7)=\"\",0,IF(H$29=0,\"\",SUMPRODUCT((IF($H$7=1,SchoolReportFilter,1))*(OFFSET(GraphicalOffset,0,MATCH(H$29,c_ReportData!$12:$12,0)-1)=IF(H$30=\"No flag\",0,1))*(PreHSReportData=$A33)*(CohortReport=1))))","v":0}]

{"sheet":"o_IndSummary","index":25,"n_rows":21,"n_cols":24,"rows_kept":21,"cut":false,"hidden":false,"merged":[[12,1,13,10],[3,1,4,10],[9,1,9,2],[10,1,10,2],[6,1,6,2],[6,9,6,10],[7,3,7,6]]}
[]
[]
[]
[null,"Risk Indicator Summary Report"]
[]
[null,null,null,null,null,null,null,null,null,null,null,null,null,null,null,null,{"$f":"COUNTA(C18:I18)-COUNTBLANK(C18:I18)","v":6},{"$f":"IF($D$7=5,4,$D$7)","v":1},{"$f":"IF(D8=\"All\",\"*\",D8)","v":"*"}]
[null,"Time Frame:",null,1,null,"Filter:",2,null,"Date:",{"$f":"TODAY()","v":"2017-12-21"},null,null,null,null,null,"Yes",1,{"$f":"i_Settings!$B12","v":"Quarter 1"},{"$f":"\"GP1_First \"&EarlyAtt&\" Day Attendance\"","v":"GP1_First 20 Day Attendance"},"GP1_Attendance","GP1_EngCourseFail","GP1_MathCourseFail","GP1_Behavior","GP1_Any Flag"]
[null,"Cohort:",null,{"$f":"SchoolRptCohort","v":"All"},null,null,null,null,null,null,null,null,null,null,null,"No",2,{"$f":"i_Settings!$B13","v":"Quarter 2"},"GP2_Attendance","GP2_EngCourseFail","GP2_MathCourseFail","GP2_Behavior","GP2_Any Flag"]
[null,null,null,null,null,null,null,null,null,null,null,null,null,null,null,null,3,{"$f":"i_Settings!$B14","v":"Quarter 3"},"GP3_Attendance","GP3_EngCourseFail","GP3_MathCourseFail","GP3_Behavior","GP3_Any Flag"]
[null,"Drop Outs:",null,{"$f":"SUM((IF($D$7=5,ISNUMBER(SEARCH(\"Dropped Out\",DropOutStatus)),DropOutStatus=\"Dropped Out\"&$D$7))*IF($G$7=1,SchoolReportFilter,1)*(CohortReport=1))","v":0},null,"Start Date:",{"$f":"IF($D$7=5,\"n/a\",IF(OFFSET(i_Settings!$D$11,$R$6,0)=0,\"--\",OFFSET(i_Settings!$D$11,$R$6,0)))","v":"--"},null,null,null,null,null,null,null,null,null,4,{"$f":"i_Settings!$B15","v":"Quarter 4"},"GP4_Attendance","GP4_EngCourseFail","GP4_MathCourseFail","GP4_Behavior","GP4_Any Flag"]
[null,"Transfers Out:",null,{"$f":"SUM((IF($D$7=5,ISNUMBER(SEARCH(\"Transferred Out\",DropOutStatus)),DropOutStatus=\"Transferred Out\"&$D$7))*IF($G$7=1,SchoolReportFilter,1)*(CohortReport=1))","v":0},null,"End Date:",{"$f":"IF($D$7=5,\"n/a\",IF(OFFSET(i_Settings!$E$11,$R$6,0)=0,\"--\",OFFSET(i_Settings!$E$11,$R$6,0)))","v":"--"},null,null,null,null,null,null,null,null,null,5,"End of year","eoy_Attendance","eoy_EngCourseFail","eoy_MathCourseFail","eoy_Behavior","eoy_Any flag"]
[]
[null,"This report shows the number of students who are flagged and not flagged for each indicator of risk for the selected grading period or time frame."]
[]
[]
[]
[null,null,{"$f":"IF(INDEX($R$7:$R$11,$D$7)=\"\",\"n/a\",INDEX(S$7:S$11,MATCH($D$7,$Q$7:$Q$11,0)))","v":"GP1_First 20 Day Attendance"},{"$f":"IF(INDEX($R$7:$R$11,$D$7)=\"\",\"n/a\",INDEX(T$7:T$11,MATCH($D$7,$Q$7:$Q$11,0)))","v":"GP1_Attendance"},"GP1_EngCourseFail","GP1_MathCourseFail","GP1_Behavior","GP1_Any Flag",0]
[null,null,{"$f":"IF(C17=\"n/a\",C17,IF(C17=0,\"\",INDEX(FieldNames!$E:$E,MATCH(C17,FieldNames!$A:$A,0))))","v":"Quarter 1 First 20 Day Attendance Flag"},{"$f":"IF(D17=\"n/a\",D17,IF(D17=0,\"\",INDEX(FieldNames!$E:$E,MATCH(D17,FieldNames!$A:$A,0))))","v":"Quarter 1 Attendance Flag"},{"$f":"IF(E17=\"n/a\",E17,IF(E17=0,\"\",INDEX(FieldNames!$E:$E,MATCH(E17,FieldNames!$A:$A,0))))","v":"Quarter 1 English Course Fail Flag"},{"$f":"IF(F17=\"n/a\",F17,IF(F17=0,\"\",INDEX(FieldNames!$E:$E,MATCH(F17,FieldNames!$A:$A,0))))","v":"Quarter 1 Math Course Fail Flag"},{"$f":"IF(G17=\"n/a\",G17,IF(G17=0,\"\",INDEX(FieldNames!$E:$E,MATCH(G17,FieldNames!$A:$A,0))))","v":"Quarter 1 Behavior Flag"},{"$f":"IF(H17=\"n/a\",H17,IF(H17=0,\"\",INDEX(FieldNames!$E:$E,MATCH(H17,FieldNames!$A:$A,0))))","v":"Quarter 1 Any Flag"},{"$f":"IF(I17=\"n/a\",I17,IF(I17=0,\"\",INDEX(FieldNames!$E:$E,MATCH(I17,FieldNames!$A:$A,0))))","v":""}]
[1,"Flagged",{"$f":"IF(C$17=0,\"\",SUMPRODUCT((OFFSET(GraphicalOffset,0,MATCH(C$17,c_ReportData!$12:$12,0)-1)=$A19)*(IF($G$7=1,SchoolReportFilter,1))*(CohortReport=1)))","v":0},{"$f":"IF(D$17=0,\"\",SUMPRODUCT((OFFSET(GraphicalOffset,0,MATCH(D$17,c_ReportData!$12:$12,0)-1)=$A19)*(IF($G$7=1,SchoolReportFilter,1))*(CohortReport=1)))","v":0},{"$f":"IF(E$17=0,\"\",SUMPRODUCT((OFFSET(GraphicalOffset,0,MATCH(E$17,c_ReportData!$12:$12,0)-1)=$A19)*(IF($G$7=1,SchoolReportFilter,1))*(CohortReport=1)))","v":0},{"$f":"IF(F$17=0,\"\",SUMPRODUCT((OFFSET(GraphicalOffset,0,MATCH(F$17,c_ReportData!$12:$12,0)-1)=$A19)*(IF($G$7=1,SchoolReportFilter,1))*(CohortReport=1)))","v":0},{"$f":"IF(G$17=0,\"\",SUMPRODUCT((OFFSET(GraphicalOffset,0,MATCH(G$17,c_ReportData!$12:$12,0)-1)=$A19)*(IF($G$7=1,SchoolReportFilter,1))*(CohortReport=1)))","v":0},{"$f":"IF(H$17=0,\"\",SUMPRODUCT((OFFSET(GraphicalOffset,0,MATCH(H$17,c_ReportData!$12:$12,0)-1)=$A19)*(IF($G$7=1,SchoolReportFilter,1))*(CohortReport=1)))","v":0},{"$f":"IF(I$17=0,\"\",SUMPRODUCT((OFFSET(GraphicalOffset,0,MATCH(I$17,c_ReportData!$12:$12,0)-1)=$A19)*(IF($G$7=1,SchoolReportFilter,1))*(CohortReport=1)))","v":""}]
[0,"Not Flagged",{"$f":"IF(C$17=0,\"\",SUMPRODUCT((OFFSET(GraphicalOffset,0,MATCH(C$17,c_ReportData!$12:$12,0)-1)=$A20)*(IF($G$7=1,SchoolReportFilter,1))*(CohortReport=1)))","v":0},{"$f":"IF(D$17=0,\"\",SUMPRODUCT((OFFSET(GraphicalOffset,0,MATCH(D$17,c_ReportData!$12:$12,0)-1)=$A20)*(IF($G$7=1,SchoolReportFilter,1))*(CohortReport=1)))","v":0},{"$f":"IF(E$17=0,\"\",SUMPRODUCT((OFFSET(GraphicalOffset,0,MATCH(E$17,c_ReportData!$12:$12,0)-1)=$A20)*(IF($G$7=1,SchoolReportFilter,1))*(CohortReport=1)))","v":0},{"$f":"IF(F$17=0,\"\",SUMPRODUCT((OFFSET(GraphicalOffset,0,MATCH(F$17,c_ReportData!$12:$12,0)-1)=$A20)*(IF($G$7=1,SchoolReportFilter,1))*(CohortReport=1)))","v":0},{"$f":"IF(G$17=0,\"\",SUMPRODUCT((OFFSET(GraphicalOffset,0,MATCH(G$17,c_ReportData!$12:$12,0)-1)=$A20)*(IF($G$7=1,SchoolReportFilter,1))*(CohortReport=1)))","v":0},{"$f":"IF(H$17=0,\"\",SUMPRODUCT((OFFSET(GraphicalOffset,0,MATCH(H$17,c_ReportData!$12:$12,0)-1)=$A20)*(IF($G$7=1,SchoolReportFilter,1))*(CohortReport=1)))","v":0},{"$f":"IF(I$17=0,\"\",SUMPRODUCT((OFFSET(GraphicalOffset,0,MATCH(I$17,c_ReportData!$12:$12,0)-1)=$A20)*(IF($G$7=1,SchoolReportFilter,1))*(CohortReport=1)))","v":""}]
[null,{"$f":"IF(COUNTIF(C21:I21,\">5\")>0,TRUE,FALSE)","v":false},{"$f":"SUM(C19:C20)","v":0},{"$f":"SUM(D19:D20)","v":0},0,0,0,0,0]

{"sheet":"o_EnrollStatusSum","index":26,"n_rows":37,"n_cols":30,"rows_kept":37,"cut":false,"hidden":false,"merged":[[6,1,6,2],[6,13,6,14],[9,1,12,7],[7,3,7,6],[3,1,4,14]]}
[]
[]
[]
[null,"Enrollment Status Summary Report"]
[]
[null,null,null,null,null,null,null,null,null,null,null,null,null,null,null,null,null,null,null,null,null,null,null,null,null,null,{"$f":"IF(D8=\"All\",\"*\",D8)","v":"*"}]
[null,"Time Frame:","Time frame:",1,null,null,null,"Filter:",2,null,null,null,"Date:",{"$f":"TODAY()","v":"2017-12-21"},null,null,null,null,null,null,null,null,null,null,null,"Yes","Year to date","Any flag",{"$f":"MATCH($AB7,c_ReportData!$12:$12,0)-1","v":49},"ArrGP1_days"]
[null,"Cohort:",null,{"$f":"SchoolRptCohort","v":"All"},null,null,null,null,null,null,null,null,null,null,null,null,null,null,null,null,null,null,null,null,null,"No",null,"Any att",{"$f":"MATCH($AB8,c_ReportData!$12:$12,0)-1","v":50},"ArrGP2_days"]
[null,null,null,null,null,null,null,null,null,null,null,null,null,null,null,null,null,null,null,null,null,null,null,null,null,null,null,"Any acad",{"$f":"MATCH($AB9,c_ReportData!$12:$12,0)-1","v":51},"ArrGP3_days"]
[null,"This report shows the number and percentage of students who are flagged and not flagged for each indicator of risk at any point during the school year, by enrollment status: (1) enrolled students, (2) students who transferred out/graduated, and (3) students who dropped out. Please refer to the 'More Info' button for additional information about this report.",null,null,null,null,null,null,null,null,null,null,null,null,null,null,null,null,null,null,null,null,null,null,null,null,null,"Any Beh",{"$f":"MATCH($AB10,c_ReportData!$12:$12,0)-1","v":52},"ArrGP4_days"]
[]
[]
[]
[]
[]
[null,null,null,1,0,"--",null,null,1,0,"--"]
[null,null,null,"Flagged","Not Flagged","No Data",null,null,"Flagged","Not Flagged","No Data"]
["ENROLLED","ENROLLED","Any Flag",{"$f":"IF(INDEX($AA$7:$AA$7,$D$7)=\"\",0,SUMPRODUCT((EnrollmentStatus=$A$18)*(OFFSET(GraphicalOffset,0,$AC7)=D$16)*(IF($I$7=1,SchoolReportFilter,1))*(CohortReport=1))+I18)","v":0},0,0,"TRANSFERRED IN","Any Flag",{"$f":"SUM((1)*(EnrollmentStatus=$G$18)*(OFFSET(GraphicalOffset,0,$AC7)=I$16)*(IF($I$7=1,SchoolReportFilter,1))*(CohortReport=1))","v":0},{"$f":"SUM((1)*(EnrollmentStatus=$G$18)*(OFFSET(GraphicalOffset,0,$AC7)=J$16)*(IF($I$7=1,SchoolReportFilter,1))*(CohortReport=1))","v":0},{"$f":"SUM((1)*(EnrollmentStatus=$G$18)*(OFFSET(GraphicalOffset,0,$AC7)=K$16)*(IF($I$7=1,SchoolReportFilter,1))*(CohortReport=1))","v":0}]
[null,null,"Attend.",0,0,0,null,"Attendance",{"$f":"SUM((1)*(EnrollmentStatus=$G$18)*(OFFSET(GraphicalOffset,0,$AC8)=I$16)*(IF($I$7=1,SchoolReportFilter,1))*(CohortReport=1))","v":0},{"$f":"SUM((1)*(EnrollmentStatus=$G$18)*(OFFSET(GraphicalOffset,0,$AC8)=J$16)*(IF($I$7=1,SchoolReportFilter,1))*(CohortReport=1))","v":0},{"$f":"SUM((1)*(EnrollmentStatus=$G$18)*(OFFSET(GraphicalOffset,0,$AC8)=K$16)*(IF($I$7=1,SchoolReportFilter,1))*(CohortReport=1))","v":0}]
[null,null,"Acad.",0,0,0,null,"Academic",{"$f":"SUM((1)*(EnrollmentStatus=$G$18)*(OFFSET(GraphicalOffset,0,$AC9)=I$16)*(IF($I$7=1,SchoolReportFilter,1))*(CohortReport=1))","v":0},{"$f":"SUM((1)*(EnrollmentStatus=$G$18)*(OFFSET(GraphicalOffset,0,$AC9)=J$16)*(IF($I$7=1,SchoolReportFilter,1))*(CohortReport=1))","v":0},{"$f":"SUM((1)*(EnrollmentStatus=$G$18)*(OFFSET(GraphicalOffset,0,$AC9)=K$16)*(IF($I$7=1,SchoolReportFilter,1))*(CohortReport=1))","v":0}]
[null,null,"Behavior",0,0,0,null,"Behavior",{"$f":"SUM((1)*(EnrollmentStatus=$G$18)*(OFFSET(GraphicalOffset,0,$AC10)=I$16)*(IF($I$7=1,SchoolReportFilter,1))*(CohortReport=1))","v":0},{"$f":"SUM((1)*(EnrollmentStatus=$G$18)*(OFFSET(GraphicalOffset,0,$AC10)=J$16)*(IF($I$7=1,SchoolReportFilter,1))*(CohortReport=1))","v":0},{"$f":"SUM((1)*(EnrollmentStatus=$G$18)*(OFFSET(GraphicalOffset,0,$AC10)=K$16)*(IF($I$7=1,SchoolReportFilter,1))*(CohortReport=1))","v":0}]
["TRANSFERRED OUT","TRANSFERRED OUT","Any Flag",{"$f":"IF(INDEX($AA$7:$AA$7,$D$7)=\"\",0,SUMPRODUCT((EnrollmentStatus=$A$22)*(OFFSET(GraphicalOffset,0,$AC7)=D$16)*(IF($I$7=1,SchoolReportFilter,1))*(CohortReport=1))+I22-D30)","v":0},0,0,"GRADUATED","Any Flag",{"$f":"IF(INDEX($AA$7:$AA$7,$D$7)=\"\",0,SUMPRODUCT((EnrollmentStatus=$G$22)*(OFFSET(GraphicalOffset,0,$AC7)=I$16)*(IF($I$7=1,SchoolReportFilter,1))*(CohortReport=1)))","v":0},0,0]
[null,null,"Attend.",0,0,0,null,"Attendance",0,0,0]
[null,null,"Acad.",0,0,0,null,"Academic",0,0,0]
[null,null,"Behavior",0,0,0,null,"Behavior",0,0,0]
["DROPPED OUT","DROPPED OUT","Any Flag",{"$f":"IF(INDEX($AA$7:$AA$7,$D$7)=\"\",0,SUMPRODUCT((EnrollmentStatus=$A$26)*(OFFSET(GraphicalOffset,0,$AC7)=D$16)*(IF($I$7=1,SchoolReportFilter,1))*(CohortReport=1))-D34)","v":0},0,0]
[null,null,"Attend.",0,0,0]
[null,null,"Acad.",0,0,0]
[null,null,"Behavior",0,0,0]
["TRANSFERRED OUT","TRANSFERRED OUT (GP)","Any Flag",{"$f":"SUM((EnrollmentStatus=$A$30)*(0)*(OFFSET(GraphicalOffset,0,$AC7)=D$16)*(IF($I$7=1,SchoolReportFilter,1))*(CohortReport=1))+I30","v":0},{"$f":"SUM((EnrollmentStatus=$A$30)*(0)*(OFFSET(GraphicalOffset,0,$AC7)=E$16)*(IF($I$7=1,SchoolReportFilter,1))*(CohortReport=1))+J30","v":0},{"$f":"SUM((EnrollmentStatus=$A$30)*(0)*(OFFSET(GraphicalOffset,0,$AC7)=F$16)*(IF($I$7=1,SchoolReportFilter,1))*(CohortReport=1))+K30","v":0},"GRADUATED (GP)","Any Flag",{"$f":"SUM((EnrollmentStatus=$G$30)*(0)*(OFFSET(GraphicalOffset,0,$AC7)=I$16)*(IF($I$7=1,SchoolReportFilter,1))*(CohortReport=1))","v":0},{"$f":"SUM((EnrollmentStatus=$G$30)*(0)*(OFFSET(GraphicalOffset,0,$AC7)=J$16)*(IF($I$7=1,SchoolReportFilter,1))*(CohortReport=1))","v":0},{"$f":"SUM((EnrollmentStatus=$G$30)*(0)*(OFFSET(GraphicalOffset,0,$AC7)=K$16)*(IF($I$7=1,SchoolReportFilter,1))*(CohortReport=1))","v":0}]
[null,null,"Attend.",{"$f":"SUM((EnrollmentStatus=$A$30)*(0)*(OFFSET(GraphicalOffset,0,$AC8)=D$16)*(IF($I$7=1,SchoolReportFilter,1))*(CohortReport=1))+I31","v":0},{"$f":"SUM((EnrollmentStatus=$A$30)*(0)*(OFFSET(GraphicalOffset,0,$AC8)=E$16)*(IF($I$7=1,SchoolReportFilter,1))*(CohortReport=1))+J31","v":0},{"$f":"SUM((EnrollmentStatus=$A$30)*(0)*(OFFSET(GraphicalOffset,0,$AC8)=F$16)*(IF($I$7=1,SchoolReportFilter,1))*(CohortReport=1))+K31","v":0},null,"Attend.",{"$f":"SUM((EnrollmentStatus=$G$30)*(0)*(OFFSET(GraphicalOffset,0,$AC8)=I$16)*(IF($I$7=1,SchoolReportFilter,1))*(CohortReport=1))","v":0},{"$f":"SUM((EnrollmentStatus=$G$30)*(0)*(OFFSET(GraphicalOffset,0,$AC8)=J$16)*(IF($I$7=1,SchoolReportFilter,1))*(CohortReport=1))","v":0},{"$f":"SUM((EnrollmentStatus=$G$30)*(0)*(OFFSET(GraphicalOffset,0,$AC8)=K$16)*(IF($I$7=1,SchoolReportFilter,1))*(CohortReport=1))","v":0}]
[null,null,"Acad.",{"$f":"SUM((EnrollmentStatus=$A$30)*(0)*(OFFSET(GraphicalOffset,0,$AC9)=D$16)*(IF($I$7=1,SchoolReportFilter,1))*(CohortReport=1))+I32","v":0},{"$f":"SUM((EnrollmentStatus=$A$30)*(0)*(OFFSET(GraphicalOffset,0,$AC9)=E$16)*(IF($I$7=1,SchoolReportFilter,1))*(CohortReport=1))+J32","v":0},{"$f":"SUM((EnrollmentStatus=$A$30)*(0)*(OFFSET(GraphicalOffset,0,$AC9)=F$16)*(IF($I$7=1,SchoolReportFilter,1))*(CohortReport=1))+K32","v":0},null,"Acad.",{"$f":"SUM((EnrollmentStatus=$G$30)*(0)*(OFFSET(GraphicalOffset,0,$AC9)=I$16)*(IF($I$7=1,SchoolReportFilter,1))*(CohortReport=1))","v":0},{"$f":"SUM((EnrollmentStatus=$G$30)*(0)*(OFFSET(GraphicalOffset,0,$AC9)=J$16)*(IF($I$7=1,SchoolReportFilter,1))*(CohortReport=1))","v":0},{"$f":"SUM((EnrollmentStatus=$G$30)*(0)*(OFFSET(GraphicalOffset,0,$AC9)=K$16)*(IF($I$7=1,SchoolReportFilter,1))*(CohortReport=1))","v":0}]
[null,null,"Behavior",{"$f":"SUM((EnrollmentStatus=$A$30)*(0)*(OFFSET(GraphicalOffset,0,$AC10)=D$16)*(IF($I$7=1,SchoolReportFilter,1))*(CohortReport=1))+I33","v":0},{"$f":"SUM((EnrollmentStatus=$A$30)*(0)*(OFFSET(GraphicalOffset,0,$AC10)=E$16)*(IF($I$7=1,SchoolReportFilter,1))*(CohortReport=1))+J33","v":0},{"$f":"SUM((EnrollmentStatus=$A$30)*(0)*(OFFSET(GraphicalOffset,0,$AC10)=F$16)*(IF($I$7=1,SchoolReportFilter,1))*(CohortReport=1))+K33","v":0},null,"Behavior",{"$f":"SUM((EnrollmentStatus=$G$30)*(0)*(OFFSET(GraphicalOffset,0,$AC10)=I$16)*(IF($I$7=1,SchoolReportFilter,1))*(CohortReport=1))","v":0},{"$f":"SUM((EnrollmentStatus=$G$30)*(0)*(OFFSET(GraphicalOffset,0,$AC10)=J$16)*(IF($I$7=1,SchoolReportFilter,1))*(CohortReport=1))","v":0},{"$f":"SUM((EnrollmentStatus=$G$30)*(0)*(OFFSET(GraphicalOffset,0,$AC10)=K$16)*(IF($I$7=1,SchoolReportFilter,1))*(CohortReport=1))","v":0}]
["DROPPED OUT","DROPPED OUT (GP)","Any Flag",{"$f":"SUM((EnrollmentStatus=$A$34)*(0)*(OFFSET(GraphicalOffset,0,$AC7)=D$16)*(IF($I$7=1,SchoolReportFilter,1))*(CohortReport=1))","v":0},{"$f":"SUM((EnrollmentStatus=$A$34)*(0)*(OFFSET(GraphicalOffset,0,$AC7)=E$16)*(IF($I$7=1,SchoolReportFilter,1))*(CohortReport=1))","v":0},{"$f":"SUM((EnrollmentStatus=$A$34)*(0)*(OFFSET(GraphicalOffset,0,$AC7)=F$16)*(IF($I$7=1,SchoolReportFilter,1))*(CohortReport=1))","v":0}]
[null,null,"Attend.",{"$f":"SUM((EnrollmentStatus=$A$34)*(0)*(OFFSET(GraphicalOffset,0,$AC8)=D$16)*(IF($I$7=1,SchoolReportFilter,1))*(CohortReport=1))","v":0},{"$f":"SUM((EnrollmentStatus=$A$34)*(0)*(OFFSET(GraphicalOffset,0,$AC8)=E$16)*(IF($I$7=1,SchoolReportFilter,1))*(CohortReport=1))","v":0},{"$f":"SUM((EnrollmentStatus=$A$34)*(0)*(OFFSET(GraphicalOffset,0,$AC8)=F$16)*(IF($I$7=1,SchoolReportFilter,1))*(CohortReport=1))","v":0}]
[null,null,"Acad.",{"$f":"SUM((EnrollmentStatus=$A$34)*(0)*(OFFSET(GraphicalOffset,0,$AC9)=D$16)*(IF($I$7=1,SchoolReportFilter,1))*(CohortReport=1))","v":0},{"$f":"SUM((EnrollmentStatus=$A$34)*(0)*(OFFSET(GraphicalOffset,0,$AC9)=E$16)*(IF($I$7=1,SchoolReportFilter,1))*(CohortReport=1))","v":0},{"$f":"SUM((EnrollmentStatus=$A$34)*(0)*(OFFSET(GraphicalOffset,0,$AC9)=F$16)*(IF($I$7=1,SchoolReportFilter,1))*(CohortReport=1))","v":0}]
[null,null,"Behavior",{"$f":"SUM((EnrollmentStatus=$A$34)*(0)*(OFFSET(GraphicalOffset,0,$AC10)=D$16)*(IF($I$7=1,SchoolReportFilter,1))*(CohortReport=1))","v":0},{"$f":"SUM((EnrollmentStatus=$A$34)*(0)*(OFFSET(GraphicalOffset,0,$AC10)=E$16)*(IF($I$7=1,SchoolReportFilter,1))*(CohortReport=1))","v":0},{"$f":"SUM((EnrollmentStatus=$A$34)*(0)*(OFFSET(GraphicalOffset,0,$AC10)=F$16)*(IF($I$7=1,SchoolReportFilter,1))*(CohortReport=1))","v":0}]

{"sheet":"o_SchIntSumType","index":27,"n_rows":20,"n_cols":16,"rows_kept":20,"cut":false,"hidden":false,"merged":[[19,1,19,4],[6,1,6,2],[3,1,4,11],[6,10,6,11],[16,1,16,4],[17,1,17,4],[18,1,18,4],[9,1,14,5],[7,3,7,6]]}
[]
[]
[]
[null,"Intervention Summary Report: Type"]
[]
[null,null,null,null,null,null,null,null,null,null,null,null,null,null,{"$f":"IF(D8=\"All\",\"*\",D8)","v":"*"}]
[null,"Time Frame:",null,1,null,null,"Filter:",2,null,"Date:",{"$f":"TODAY()","v":"2017-12-21"},null,null,"Yes","Year to date",{"$f":"IF(D7=6,0,D7)","v":1}]
[null,"Cohort:",null,{"$f":"SchoolRptCohort","v":"All"},null,null,null,null,null,null,null,null,null,"No"]
[]
[null,"This report shows the number and percentage of students who were assigned to different types of intervention programs (academic, behavior, or attendance interventions), by tier. Students are included if they were assigned to an intervention program at any point during the school year.",null,null,null,null,null,null,null,"Attendance","Behavior","Academic"]
[null,null,null,null,null,null,null,null,"Tier I",{"$f":"SUMPRODUCT((OFFSET(GraphicalOffset,0,J17-1)=1)*(IF($H$7=1,SchoolReportFilter,1))*(CohortReport=1))","v":0},0,0]
[null,null,null,null,null,null,null,null,"Tier II",0,0,0]
[null,null,null,null,null,null,null,null,"Tier III",0,0,0]
[]
[]
[null,null,null,null,null,null,null,null,null,"Att","Beh","Aca"]
[null,"Total number of students",null,null,null,{"$f":"SUM(CohortReport)","v":1},null,null,"Tier1",{"$f":"MATCH(J$16&$I17,c_ReportData!$12:$12,0)","v":67},{"$f":"MATCH(K$16&$I17,c_ReportData!$12:$12,0)","v":70},{"$f":"MATCH(L$16&$I17,c_ReportData!$12:$12,0)","v":73}]
["AnyAttInt","Percentage students in Attendance Interventions",null,null,null,{"$f":"IF($F$17=0,0,SUMPRODUCT((OFFSET(GraphicalOffset,0,MATCH($A18,c_ReportData!$12:$12,0)-1)=1)*(CohortReport=1))/$F$17)","v":0},null,null,"Tier2",{"$f":"MATCH(J$16&$I18,c_ReportData!$12:$12,0)","v":68},{"$f":"MATCH(K$16&$I18,c_ReportData!$12:$12,0)","v":71},{"$f":"MATCH(L$16&$I18,c_ReportData!$12:$12,0)","v":74}]
["AnyBehInt","Percentage students in Behavior Interventions",null,null,null,{"$f":"IF($F$17=0,0,SUMPRODUCT((OFFSET(GraphicalOffset,0,MATCH($A19,c_ReportData!$12:$12,0)-1)=1)*(CohortReport=1))/$F$17)","v":0},null,null,"Tier3",{"$f":"MATCH(J$16&$I19,c_ReportData!$12:$12,0)","v":69},{"$f":"MATCH(K$16&$I19,c_ReportData!$12:$12,0)","v":72},{"$f":"MATCH(L$16&$I19,c_ReportData!$12:$12,0)","v":75}]
["AnyAcadInt","Percentage students in Academic Interventions",null,null,null,{"$f":"IF($F$17=0,0,SUMPRODUCT((OFFSET(GraphicalOffset,0,MATCH($A20,c_ReportData!$12:$12,0)-1)=1)*(CohortReport=1))/$F$17)","v":0}]

{"sheet":"o_SchIntSum","index":28,"n_rows":20,"n_cols":50,"rows_kept":20,"cut":false,"hidden":false,"merged":[[3,1,4,11],[6,10,6,11],[6,1,6,2],[7,1,7,2],[10,1,12,11],[8,3,8,6]]}
[]
[]
[]
[null,"Intervention Summary Report: Program"]
[null,null,null,null,null,null,null,null,null,null,null,null,null,null,null,null,null,null,null,null,null,null,null,null,null,{"$f":"IF(D9=\"All\",\"*\",D9)","v":"*"},{"$f":"IF(GP_Type=3,1,IF(GP_Type=2,4,8))","v":8},{"$f":"COLUMN(c_ReportData!CN1)","v":92}]
[null,null,null,null,null,null,null,null,null,null,null,null,null,null,null,null,null,null,{"$f":"INDEX($S$7:$S$10,$D$7)","v":"Disability_flag"},null,null,null,null,null,{"$f":"INDEX(CurrInterventions,$D$8)","v":0},{"$f":"INDEX(i_IntDesc!$C$12:$C$41,$D$8)","v":0},null,"Attendance"]
[null,"Characteristic:",null,2,null,null,"Filter:",2,null,"Date:",{"$f":"TODAY()","v":"2017-12-21"},null,null,null,null,null,"Yes","All Students","Any char flag",null,null,null,null,null,null,{"$f":"i_Settings!$B12","v":"Quarter 1"},"GP1_Int sum","Pre-HS indicator",{"$f":"\"GP1_First \"&EarlyAtt&\" Day Attendance\"","v":"GP1_First 20 Day Attendance"},"GP1_Attendance","GP1_EngCourseFail","GP1_MathCourseFail","GP1_Behavior","GP2_Attendance","GP2_EngCourseFail","GP2_MathCourseFail","GP2_Behavior","GP3_Attendance","GP3_EngCourseFail","GP3_MathCourseFail","GP3_Behavior","GP4_Attendance","GP4_EngCourseFail","GP4_MathCourseFail","GP4_Behavior","eoy_Attendance","eoy_EngCourseFail","eoy_MathCourseFail","eoy_Behavior"]
[null,"Intervention:",null,1,null,null,null,null,null,null,null,null,null,null,null,null,"No","Disabilities","Disability_flag",null,null,null,null,null,null,{"$f":"i_Settings!$B13","v":"Quarter 2"},"GP2_Int sum","Academic"]
[null,"Cohort:",null,{"$f":"SchoolRptCohort","v":"All"},null,null,null,null,null,null,null,null,null,null,null,null,null,"ELL","ELL_flag",null,null,null,null,null,null,{"$f":"i_Settings!$B14","v":"Quarter 3"},"GP3_Int sum","Pre-HS indicator",{"$f":"\"GP1_First \"&EarlyAtt&\" Day Attendance\"","v":"GP1_First 20 Day Attendance"},"GP1_Attendance","GP1_EngCourseFail","GP1_MathCourseFail","GP1_Behavior","GP2_Attendance","GP2_EngCourseFail","GP2_MathCourseFail","GP2_Behavior","GP3_Attendance","GP3_EngCourseFail","GP3_MathCourseFail","GP3_Behavior","GP4_Attendance","GP4_EngCourseFail","GP4_MathCourseFail","GP4_Behavior","eoy_Attendance","eoy_EngCourseFail","eoy_MathCourseFail","eoy_Behavior"]
[null,null,null,null,null,null,null,null,null,null,null,null,null,null,null,null,null,"Disadvantaged","Disadvantaged_flag",null,null,null,null,null,null,{"$f":"i_Settings!$B15","v":"Quarter 4"},"GP4_Int sum","Behavior"]
[null,"This report shows the number of students that were assigned to the selected intervention program at any point during the school year. It also shows a summary of the indicators of risk for which they are flagged or not flagged for the selected grading period or time frame. Please refer to the 'More Info' button for additional information about this report.",null,null,null,null,null,null,null,null,null,null,null,null,null,null,null,null,null,null,null,null,null,null,null,"End of year","eoy_Int sum","Pre-HS indicator",{"$f":"\"GP1_First \"&EarlyAtt&\" Day Attendance\"","v":"GP1_First 20 Day Attendance"},"GP1_Attendance","GP1_EngCourseFail","GP1_MathCourseFail","GP1_Behavior","GP2_Attendance","GP2_EngCourseFail","GP2_MathCourseFail","GP2_Behavior","GP3_Attendance","GP3_EngCourseFail","GP3_MathCourseFail","GP3_Behavior","GP4_Attendance","GP4_EngCourseFail","GP4_MathCourseFail","GP4_Behavior","eoy_Attendance","eoy_EngCourseFail","eoy_MathCourseFail","eoy_Behavior"]
[]
[null,null,null,null,null,null,null,null,null,null,null,null,null,null,null,null,null,null,null,null,null,null,null,null,null,1,"eoy_Int sum","Pre-HS indicator",{"$f":"\"GP1_First \"&EarlyAtt&\" Day Attendance\"","v":"GP1_First 20 Day Attendance"},"GP1_Attendance","GP1_EngCourseFail","GP1_MathCourseFail","GP1_Behavior","GP2_Attendance","GP2_EngCourseFail","GP2_MathCourseFail","GP2_Behavior","GP3_Attendance","GP3_EngCourseFail","GP3_MathCourseFail","GP3_Behavior","GP4_Attendance","GP4_EngCourseFail","GP4_MathCourseFail","GP4_Behavior","eoy_Attendance","eoy_EngCourseFail","eoy_MathCourseFail","eoy_Behavior"]
[null,null,null,null,null,null,null,null,null,null,null,null,null,null,null,null,null,null,null,null,null,null,null,null,null,2,"eoy_Int sum","Pre-HS indicator",{"$f":"\"GP1_First \"&EarlyAtt&\" Day Attendance\"","v":"GP1_First 20 Day Attendance"},"GP1_Attendance","GP1_EngCourseFail","GP1_MathCourseFail","GP1_Behavior","GP2_Attendance","GP2_EngCourseFail","GP2_MathCourseFail","GP2_Behavior","GP3_Attendance","GP3_EngCourseFail","GP3_MathCourseFail","GP3_Behavior","eoy_Attendance","eoy_EngCourseFail","eoy_MathCourseFail","eoy_Behavior"]
[null,null,{"$f":"INDEX(AB$13:AB$15,GP_Type)","v":"Pre-HS indicator"},{"$f":"INDEX(AC$13:AC$15,GP_Type)","v":"GP1_First 20 Day Attendance"},{"$f":"INDEX(AD$13:AD$15,GP_Type)","v":"GP1_Attendance"},{"$f":"INDEX(AE$13:AE$15,GP_Type)","v":"GP1_EngCourseFail"},{"$f":"INDEX(AF$13:AF$15,GP_Type)","v":"GP1_MathCourseFail"},{"$f":"INDEX(AG$13:AG$15,GP_Type)","v":"GP1_Behavior"},{"$f":"INDEX(AH$13:AH$15,GP_Type)","v":"GP2_Attendance"},{"$f":"INDEX(AI$13:AI$15,GP_Type)","v":"GP2_EngCourseFail"},{"$f":"INDEX(AJ$13:AJ$15,GP_Type)","v":"GP2_MathCourseFail"},{"$f":"INDEX(AK$13:AK$15,GP_Type)","v":"GP2_Behavior"},{"$f":"INDEX(AL$13:AL$15,GP_Type)","v":"GP3_Attendance"},{"$f":"INDEX(AM$13:AM$15,GP_Type)","v":"GP3_EngCourseFail"},{"$f":"INDEX(AN$13:AN$15,GP_Type)","v":"GP3_MathCourseFail"},{"$f":"INDEX(AO$13:AO$15,GP_Type)","v":"GP3_Behavior"},{"$f":"INDEX(AP$13:AP$15,GP_Type)","v":"GP4_Attendance"},{"$f":"INDEX(AQ$13:AQ$15,GP_Type)","v":"GP4_EngCourseFail"},{"$f":"INDEX(AR$13:AR$15,GP_Type)","v":"GP4_MathCourseFail"},{"$f":"INDEX(AS$13:AS$15,GP_Type)","v":"GP4_Behavior"},{"$f":"INDEX(AT$13:AT$15,GP_Type)","v":"eoy_Attendance"},{"$f":"INDEX(AU$13:AU$15,GP_Type)","v":"eoy_EngCourseFail"},{"$f":"INDEX(AV$13:AV$15,GP_Type)","v":"eoy_MathCourseFail"},{"$f":"INDEX(AW$13:AW$15,GP_Type)","v":"eoy_Behavior"},null,3,"eoy_Int sum","Pre-HS indicator",{"$f":"\"GP1_First \"&EarlyAtt&\" Day Attendance\"","v":"GP1_First 20 Day Attendance"},"GP1_Attendance","GP1_EngCourseFail","GP1_MathCourseFail","GP1_Behavior","GP2_Attendance","GP2_EngCourseFail","GP2_MathCourseFail","GP2_Behavior","eoy_Attendance","eoy_EngCourseFail","eoy_MathCourseFail","eoy_Behavior",null,null,null,null,null,null,null,null,"x"]
[null,null,{"$f":"INDEX(FieldNames!$E:$E,MATCH(C15,FieldNames!$A:$A,0))","v":"Incoming Risk Indicator"},{"$f":"INDEX(FieldNames!$E:$E,MATCH(D15,FieldNames!$A:$A,0))","v":"Quarter 1 First 20 Day Attendance Flag"},{"$f":"INDEX(FieldNames!$E:$E,MATCH(E15,FieldNames!$A:$A,0))","v":"Quarter 1 Attendance Flag"},{"$f":"INDEX(FieldNames!$E:$E,MATCH(F15,FieldNames!$A:$A,0))","v":"Quarter 1 English Course Fail Flag"},{"$f":"INDEX(FieldNames!$E:$E,MATCH(G15,FieldNames!$A:$A,0))","v":"Quarter 1 Math Course Fail Flag"},{"$f":"INDEX(FieldNames!$E:$E,MATCH(H15,FieldNames!$A:$A,0))","v":"Quarter 1 Behavior Flag"},{"$f":"INDEX(FieldNames!$E:$E,MATCH(I15,FieldNames!$A:$A,0))","v":"Quarter 2 Attendance Flag"},{"$f":"INDEX(FieldNames!$E:$E,MATCH(J15,FieldNames!$A:$A,0))","v":"Quarter 2 English Course Fail Flag"},{"$f":"INDEX(FieldNames!$E:$E,MATCH(K15,FieldNames!$A:$A,0))","v":"Quarter 2 Math Course Fail Flag"},{"$f":"INDEX(FieldNames!$E:$E,MATCH(L15,FieldNames!$A:$A,0))","v":"Quarter 2 Behavior Flag"},{"$f":"INDEX(FieldNames!$E:$E,MATCH(M15,FieldNames!$A:$A,0))","v":"Quarter 3 Attendance Flag"},{"$f":"INDEX(FieldNames!$E:$E,MATCH(N15,FieldNames!$A:$A,0))","v":"Quarter 3 English Course Fail Flag"},{"$f":"INDEX(FieldNames!$E:$E,MATCH(O15,FieldNames!$A:$A,0))","v":"Quarter 3 Math Course Fail Flag"},{"$f":"INDEX(FieldNames!$E:$E,MATCH(P15,FieldNames!$A:$A,0))","v":"Quarter 3 Behavior Flag"},{"$f":"INDEX(FieldNames!$E:$E,MATCH(Q15,FieldNames!$A:$A,0))","v":"Quarter 4 Attendance Flag"},{"$f":"INDEX(FieldNames!$E:$E,MATCH(R15,FieldNames!$A:$A,0))","v":"Quarter 4 English Course Fail Flag"},{"$f":"INDEX(FieldNames!$E:$E,MATCH(S15,FieldNames!$A:$A,0))","v":"Quarter 4 Math Course Fail Flag"},{"$f":"INDEX(FieldNames!$E:$E,MATCH(T15,FieldNames!$A:$A,0))","v":"Quarter 4 Behavior Flag"},{"$f":"INDEX(FieldNames!$E:$E,MATCH(U15,FieldNames!$A:$A,0))","v":"End of Year Attendance Flag"},{"$f":"INDEX(FieldNames!$E:$E,MATCH(V15,FieldNames!$A:$A,0))","v":"End of Year English Course Fail Flag"},{"$f":"INDEX(FieldNames!$E:$E,MATCH(W15,FieldNames!$A:$A,0))","v":"End of Year Math Course Fail Flag"},{"$f":"INDEX(FieldNames!$E:$E,MATCH(X15,FieldNames!$A:$A,0))","v":"End of Year Behavior Flag"},null,null,null,null,null,null,null,null,null,null,null,null,null,null,null,null,null,null,null,null,null,null,null,null,null,"x"]
[1,"Flagged",{"$f":"IF(C$15=0,\"\",SUMPRODUCT((IF($D$7=1,1,INDIRECT($S$6))=1)*(OFFSET(GraphicalOffset,0,$AB$5-1)=1)*(OFFSET(GraphicalOffset,0,MATCH(C$15,c_ReportData!$12:$12,0)-1)=$A17)*(IF($H$7=1,SchoolReportFilter,1))*(CohortReport=1)))","v":0},{"$f":"IF(D$15=0,\"\",SUMPRODUCT((IF($D$7=1,1,INDIRECT($S$6))=1)*(OFFSET(GraphicalOffset,0,$AB$5-1)=1)*(OFFSET(GraphicalOffset,0,MATCH(D$15,c_ReportData!$12:$12,0)-1)=$A17)*(IF($H$7=1,SchoolReportFilter,1))*(CohortReport=1)))","v":0},{"$f":"IF(E$15=0,\"\",SUMPRODUCT((IF($D$7=1,1,INDIRECT($S$6))=1)*(OFFSET(GraphicalOffset,0,$AB$5-1)=1)*(OFFSET(GraphicalOffset,0,MATCH(E$15,c_ReportData!$12:$12,0)-1)=$A17)*(IF($H$7=1,SchoolReportFilter,1))*(CohortReport=1)))","v":0},{"$f":"IF(F$15=0,\"\",SUMPRODUCT((IF($D$7=1,1,INDIRECT($S$6))=1)*(OFFSET(GraphicalOffset,0,$AB$5-1)=1)*(OFFSET(GraphicalOffset,0,MATCH(F$15,c_ReportData!$12:$12,0)-1)=$A17)*(IF($H$7=1,SchoolReportFilter,1))*(CohortReport=1)))","v":0},{"$f":"IF(G$15=0,\"\",SUMPRODUCT((IF($D$7=1,1,INDIRECT($S$6))=1)*(OFFSET(GraphicalOffset,0,$AB$5-1)=1)*(OFFSET(GraphicalOffset,0,MATCH(G$15,c_ReportData!$12:$12,0)-1)=$A17)*(IF($H$7=1,SchoolReportFilter,1))*(CohortReport=1)))","v":0},{"$f":"IF(H$15=0,\"\",SUMPRODUCT((IF($D$7=1,1,INDIRECT($S$6))=1)*(OFFSET(GraphicalOffset,0,$AB$5-1)=1)*(OFFSET(GraphicalOffset,0,MATCH(H$15,c_ReportData!$12:$12,0)-1)=$A17)*(IF($H$7=1,SchoolReportFilter,1))*(CohortReport=1)))","v":0},{"$f":"IF(I$15=0,\"\",SUMPRODUCT((IF($D$7=1,1,INDIRECT($S$6))=1)*(OFFSET(GraphicalOffset,0,$AB$5-1)=1)*(OFFSET(GraphicalOffset,0,MATCH(I$15,c_ReportData!$12:$12,0)-1)=$A17)*(IF($H$7=1,SchoolReportFilter,1))*(CohortReport=1)))","v":0},{"$f":"IF(J$15=0,\"\",SUMPRODUCT((IF($D$7=1,1,INDIRECT($S$6))=1)*(OFFSET(GraphicalOffset,0,$AB$5-1)=1)*(OFFSET(GraphicalOffset,0,MATCH(J$15,c_ReportData!$12:$12,0)-1)=$A17)*(IF($H$7=1,SchoolReportFilter,1))*(CohortReport=1)))","v":0},{"$f":"IF(K$15=0,\"\",SUMPRODUCT((IF($D$7=1,1,INDIRECT($S$6))=1)*(OFFSET(GraphicalOffset,0,$AB$5-1)=1)*(OFFSET(GraphicalOffset,0,MATCH(K$15,c_ReportData!$12:$12,0)-1)=$A17)*(IF($H$7=1,SchoolReportFilter,1))*(CohortReport=1)))","v":0},{"$f":"IF(L$15=0,\"\",SUMPRODUCT((IF($D$7=1,1,INDIRECT($S$6))=1)*(OFFSET(GraphicalOffset,0,$AB$5-1)=1)*(OFFSET(GraphicalOffset,0,MATCH(L$15,c_ReportData!$12:$12,0)-1)=$A17)*(IF($H$7=1,SchoolReportFilter,1))*(CohortReport=1)))","v":0},{"$f":"IF(M$15=0,\"\",SUMPRODUCT((IF($D$7=1,1,INDIRECT($S$6))=1)*(OFFSET(GraphicalOffset,0,$AB$5-1)=1)*(OFFSET(GraphicalOffset,0,MATCH(M$15,c_ReportData!$12:$12,0)-1)=$A17)*(IF($H$7=1,SchoolReportFilter,1))*(CohortReport=1)))","v":0},{"$f":"IF(N$15=0,\"\",SUMPRODUCT((IF($D$7=1,1,INDIRECT($S$6))=1)*(OFFSET(GraphicalOffset,0,$AB$5-1)=1)*(OFFSET(GraphicalOffset,0,MATCH(N$15,c_ReportData!$12:$12,0)-1)=$A17)*(IF($H$7=1,SchoolReportFilter,1))*(CohortReport=1)))","v":0},{"$f":"IF(O$15=0,\"\",SUMPRODUCT((IF($D$7=1,1,INDIRECT($S$6))=1)*(OFFSET(GraphicalOffset,0,$AB$5-1)=1)*(OFFSET(GraphicalOffset,0,MATCH(O$15,c_ReportData!$12:$12,0)-1)=$A17)*(IF($H$7=1,SchoolReportFilter,1))*(CohortReport=1)))","v":0},{"$f":"IF(P$15=0,\"\",SUMPRODUCT((IF($D$7=1,1,INDIRECT($S$6))=1)*(OFFSET(GraphicalOffset,0,$AB$5-1)=1)*(OFFSET(GraphicalOffset,0,MATCH(P$15,c_ReportData!$12:$12,0)-1)=$A17)*(IF($H$7=1,SchoolReportFilter,1))*(CohortReport=1)))","v":0},{"$f":"IF(Q$15=0,\"\",SUMPRODUCT((IF($D$7=1,1,INDIRECT($S$6))=1)*(OFFSET(GraphicalOffset,0,$AB$5-1)=1)*(OFFSET(GraphicalOffset,0,MATCH(Q$15,c_ReportData!$12:$12,0)-1)=$A17)*(IF($H$7=1,SchoolReportFilter,1))*(CohortReport=1)))","v":0},{"$f":"IF(R$15=0,\"\",SUMPRODUCT((IF($D$7=1,1,INDIRECT($S$6))=1)*(OFFSET(GraphicalOffset,0,$AB$5-1)=1)*(OFFSET(GraphicalOffset,0,MATCH(R$15,c_ReportData!$12:$12,0)-1)=$A17)*(IF($H$7=1,SchoolReportFilter,1))*(CohortReport=1)))","v":0},{"$f":"IF(S$15=0,\"\",SUMPRODUCT((IF($D$7=1,1,INDIRECT($S$6))=1)*(OFFSET(GraphicalOffset,0,$AB$5-1)=1)*(OFFSET(GraphicalOffset,0,MATCH(S$15,c_ReportData!$12:$12,0)-1)=$A17)*(IF($H$7=1,SchoolReportFilter,1))*(CohortReport=1)))","v":0},{"$f":"IF(T$15=0,\"\",SUMPRODUCT((IF($D$7=1,1,INDIRECT($S$6))=1)*(OFFSET(GraphicalOffset,0,$AB$5-1)=1)*(OFFSET(GraphicalOffset,0,MATCH(T$15,c_ReportData!$12:$12,0)-1)=$A17)*(IF($H$7=1,SchoolReportFilter,1))*(CohortReport=1)))","v":0},{"$f":"IF(U$15=0,\"\",SUMPRODUCT((IF($D$7=1,1,INDIRECT($S$6))=1)*(OFFSET(GraphicalOffset,0,$AB$5-1)=1)*(OFFSET(GraphicalOffset,0,MATCH(U$15,c_ReportData!$12:$12,0)-1)=$A17)*(IF($H$7=1,SchoolReportFilter,1))*(CohortReport=1)))","v":0},{"$f":"IF(V$15=0,\"\",SUMPRODUCT((IF($D$7=1,1,INDIRECT($S$6))=1)*(OFFSET(GraphicalOffset,0,$AB$5-1)=1)*(OFFSET(GraphicalOffset,0,MATCH(V$15,c_ReportData!$12:$12,0)-1)=$A17)*(IF($H$7=1,SchoolReportFilter,1))*(CohortReport=1)))","v":0},{"$f":"IF(W$15=0,\"\",SUMPRODUCT((IF($D$7=1,1,INDIRECT($S$6))=1)*(OFFSET(GraphicalOffset,0,$AB$5-1)=1)*(OFFSET(GraphicalOffset,0,MATCH(W$15,c_ReportData!$12:$12,0)-1)=$A17)*(IF($H$7=1,SchoolReportFilter,1))*(CohortReport=1)))","v":0},{"$f":"IF(X$15=0,\"\",SUMPRODUCT((IF($D$7=1,1,INDIRECT($S$6))=1)*(OFFSET(GraphicalOffset,0,$AB$5-1)=1)*(OFFSET(GraphicalOffset,0,MATCH(X$15,c_ReportData!$12:$12,0)-1)=$A17)*(IF($H$7=1,SchoolReportFilter,1))*(CohortReport=1)))","v":0},null,1,"eoy_Int sum","Pre-HS indicator","Q1 First 20 Day Attendance","Q1 Attendance","Q1 English Course Fail","Q1 Math Course Fail","Q1 Behavior","Q2 Attendance","Q2 English Course Fail","Q2 Math Course Fail","Q2 Behavior","Q3 Attendance","Q3 English Course Fail","Q3 Math Course Fail","Q3 Behavior","Q4 Attendance","Q4 English Course Fail","Q4 Math Course Fail","Q4 Behavior","EoY Attendance","EoY4 English Course Fail","EoY Math Course Fail","EoY Behavior"]
[0,"Not Flagged",{"$f":"IF(C$15=0,\"\",SUMPRODUCT((IF($D$7=1,1,INDIRECT($S$6))=1)*(OFFSET(GraphicalOffset,0,$AB$5-1)=1)*(OFFSET(GraphicalOffset,0,MATCH(C$15,c_ReportData!$12:$12,0)-1)=$A18)*(IF($H$7=1,SchoolReportFilter,1))*(CohortReport=1)))","v":0},{"$f":"IF(D$15=0,\"\",SUMPRODUCT((IF($D$7=1,1,INDIRECT($S$6))=1)*(OFFSET(GraphicalOffset,0,$AB$5-1)=1)*(OFFSET(GraphicalOffset,0,MATCH(D$15,c_ReportData!$12:$12,0)-1)=$A18)*(IF($H$7=1,SchoolReportFilter,1))*(CohortReport=1)))","v":0},{"$f":"IF(E$15=0,\"\",SUMPRODUCT((IF($D$7=1,1,INDIRECT($S$6))=1)*(OFFSET(GraphicalOffset,0,$AB$5-1)=1)*(OFFSET(GraphicalOffset,0,MATCH(E$15,c_ReportData!$12:$12,0)-1)=$A18)*(IF($H$7=1,SchoolReportFilter,1))*(CohortReport=1)))","v":0},{"$f":"IF(F$15=0,\"\",SUMPRODUCT((IF($D$7=1,1,INDIRECT($S$6))=1)*(OFFSET(GraphicalOffset,0,$AB$5-1)=1)*(OFFSET(GraphicalOffset,0,MATCH(F$15,c_ReportData!$12:$12,0)-1)=$A18)*(IF($H$7=1,SchoolReportFilter,1))*(CohortReport=1)))","v":0},{"$f":"IF(G$15=0,\"\",SUMPRODUCT((IF($D$7=1,1,INDIRECT($S$6))=1)*(OFFSET(GraphicalOffset,0,$AB$5-1)=1)*(OFFSET(GraphicalOffset,0,MATCH(G$15,c_ReportData!$12:$12,0)-1)=$A18)*(IF($H$7=1,SchoolReportFilter,1))*(CohortReport=1)))","v":0},{"$f":"IF(H$15=0,\"\",SUMPRODUCT((IF($D$7=1,1,INDIRECT($S$6))=1)*(OFFSET(GraphicalOffset,0,$AB$5-1)=1)*(OFFSET(GraphicalOffset,0,MATCH(H$15,c_ReportData!$12:$12,0)-1)=$A18)*(IF($H$7=1,SchoolReportFilter,1))*(CohortReport=1)))","v":0},{"$f":"IF(I$15=0,\"\",SUMPRODUCT((IF($D$7=1,1,INDIRECT($S$6))=1)*(OFFSET(GraphicalOffset,0,$AB$5-1)=1)*(OFFSET(GraphicalOffset,0,MATCH(I$15,c_ReportData!$12:$12,0)-1)=$A18)*(IF($H$7=1,SchoolReportFilter,1))*(CohortReport=1)))","v":0},{"$f":"IF(J$15=0,\"\",SUMPRODUCT((IF($D$7=1,1,INDIRECT($S$6))=1)*(OFFSET(GraphicalOffset,0,$AB$5-1)=1)*(OFFSET(GraphicalOffset,0,MATCH(J$15,c_ReportData!$12:$12,0)-1)=$A18)*(IF($H$7=1,SchoolReportFilter,1))*(CohortReport=1)))","v":0},{"$f":"IF(K$15=0,\"\",SUMPRODUCT((IF($D$7=1,1,INDIRECT($S$6))=1)*(OFFSET(GraphicalOffset,0,$AB$5-1)=1)*(OFFSET(GraphicalOffset,0,MATCH(K$15,c_ReportData!$12:$12,0)-1)=$A18)*(IF($H$7=1,SchoolReportFilter,1))*(CohortReport=1)))","v":0},{"$f":"IF(L$15=0,\"\",SUMPRODUCT((IF($D$7=1,1,INDIRECT($S$6))=1)*(OFFSET(GraphicalOffset,0,$AB$5-1)=1)*(OFFSET(GraphicalOffset,0,MATCH(L$15,c_ReportData!$12:$12,0)-1)=$A18)*(IF($H$7=1,SchoolReportFilter,1))*(CohortReport=1)))","v":0},{"$f":"IF(M$15=0,\"\",SUMPRODUCT((IF($D$7=1,1,INDIRECT($S$6))=1)*(OFFSET(GraphicalOffset,0,$AB$5-1)=1)*(OFFSET(GraphicalOffset,0,MATCH(M$15,c_ReportData!$12:$12,0)-1)=$A18)*(IF($H$7=1,SchoolReportFilter,1))*(CohortReport=1)))","v":0},{"$f":"IF(N$15=0,\"\",SUMPRODUCT((IF($D$7=1,1,INDIRECT($S$6))=1)*(OFFSET(GraphicalOffset,0,$AB$5-1)=1)*(OFFSET(GraphicalOffset,0,MATCH(N$15,c_ReportData!$12:$12,0)-1)=$A18)*(IF($H$7=1,SchoolReportFilter,1))*(CohortReport=1)))","v":0},{"$f":"IF(O$15=0,\"\",SUMPRODUCT((IF($D$7=1,1,INDIRECT($S$6))=1)*(OFFSET(GraphicalOffset,0,$AB$5-1)=1)*(OFFSET(GraphicalOffset,0,MATCH(O$15,c_ReportData!$12:$12,0)-1)=$A18)*(IF($H$7=1,SchoolReportFilter,1))*(CohortReport=1)))","v":0},{"$f":"IF(P$15=0,\"\",SUMPRODUCT((IF($D$7=1,1,INDIRECT($S$6))=1)*(OFFSET(GraphicalOffset,0,$AB$5-1)=1)*(OFFSET(GraphicalOffset,0,MATCH(P$15,c_ReportData!$12:$12,0)-1)=$A18)*(IF($H$7=1,SchoolReportFilter,1))*(CohortReport=1)))","v":0},{"$f":"IF(Q$15=0,\"\",SUMPRODUCT((IF($D$7=1,1,INDIRECT($S$6))=1)*(OFFSET(GraphicalOffset,0,$AB$5-1)=1)*(OFFSET(GraphicalOffset,0,MATCH(Q$15,c_ReportData!$12:$12,0)-1)=$A18)*(IF($H$7=1,SchoolReportFilter,1))*(CohortReport=1)))","v":0},{"$f":"IF(R$15=0,\"\",SUMPRODUCT((IF($D$7=1,1,INDIRECT($S$6))=1)*(OFFSET(GraphicalOffset,0,$AB$5-1)=1)*(OFFSET(GraphicalOffset,0,MATCH(R$15,c_ReportData!$12:$12,0)-1)=$A18)*(IF($H$7=1,SchoolReportFilter,1))*(CohortReport=1)))","v":0},{"$f":"IF(S$15=0,\"\",SUMPRODUCT((IF($D$7=1,1,INDIRECT($S$6))=1)*(OFFSET(GraphicalOffset,0,$AB$5-1)=1)*(OFFSET(GraphicalOffset,0,MATCH(S$15,c_ReportData!$12:$12,0)-1)=$A18)*(IF($H$7=1,SchoolReportFilter,1))*(CohortReport=1)))","v":0},{"$f":"IF(T$15=0,\"\",SUMPRODUCT((IF($D$7=1,1,INDIRECT($S$6))=1)*(OFFSET(GraphicalOffset,0,$AB$5-1)=1)*(OFFSET(GraphicalOffset,0,MATCH(T$15,c_ReportData!$12:$12,0)-1)=$A18)*(IF($H$7=1,SchoolReportFilter,1))*(CohortReport=1)))","v":0},{"$f":"IF(U$15=0,\"\",SUMPRODUCT((IF($D$7=1,1,INDIRECT($S$6))=1)*(OFFSET(GraphicalOffset,0,$AB$5-1)=1)*(OFFSET(GraphicalOffset,0,MATCH(U$15,c_ReportData!$12:$12,0)-1)=$A18)*(IF($H$7=1,SchoolReportFilter,1))*(CohortReport=1)))","v":0},{"$f":"IF(V$15=0,\"\",SUMPRODUCT((IF($D$7=1,1,INDIRECT($S$6))=1)*(OFFSET(GraphicalOffset,0,$AB$5-1)=1)*(OFFSET(GraphicalOffset,0,MATCH(V$15,c_ReportData!$12:$12,0)-1)=$A18)*(IF($H$7=1,SchoolReportFilter,1))*(CohortReport=1)))","v":0},{"$f":"IF(W$15=0,\"\",SUMPRODUCT((IF($D$7=1,1,INDIRECT($S$6))=1)*(OFFSET(GraphicalOffset,0,$AB$5-1)=1)*(OFFSET(GraphicalOffset,0,MATCH(W$15,c_ReportData!$12:$12,0)-1)=$A18)*(IF($H$7=1,SchoolReportFilter,1))*(CohortReport=1)))","v":0},{"$f":"IF(X$15=0,\"\",SUMPRODUCT((IF($D$7=1,1,INDIRECT($S$6))=1)*(OFFSET(GraphicalOffset,0,$AB$5-1)=1)*(OFFSET(GraphicalOffset,0,MATCH(X$15,c_ReportData!$12:$12,0)-1)=$A18)*(IF($H$7=1,SchoolReportFilter,1))*(CohortReport=1)))","v":0},null,2,"eoy_Int sum","Pre-HS indicator","T1 First 20 Day Attendance","T1 Attendance","T1 English Course Fail","T1 Math Course Fail","T1 Behavior","T2 Attendance","T2 English Course Fail","T2 Math Course Fail","T2 Behavior","T3 Attendance","T3 English Course Fail","T3 Math Course Fail","T3 Behavior","EoY Attendance","EoY4 English Course Fail","EoY Math Course Fail","EoY Behavior"]
[null,null,{"$f":"SUM(C17:C18)","v":0},{"$f":"SUM(D17:D18)","v":0},0,0,0,0,0,0,0,0,0,0,0,0,0,0,0,0,{"$f":"SUM(U17:U18)","v":0},0,0,0,null,3,"eoy_InS sum","Pre-HS indicaSor","S1 First 20 Day Attendance","S1 Attendance","S1 English Course Fail","S1 Math Course Fail","S1 Behavior","S2 Attendance","S2 English Course Fail","S2 Math Course Fail","S2 Behavior","EoY Attendance","EoY3 English Course Fail","EoY3 Math Course Fail","EoY Behavior"]
[null,null,{"$f":"IF(COUNTIF(C19:H19,\">=5\")>0,TRUE,FALSE)","v":false},{"$f":"IF(COUNTIF(I19:P19,\">=5\")>0,TRUE,FALSE)","v":false},{"$f":"IF(COUNTIF(OFFSET(Q19,0,0,1,SchoolIntSumRptBars),\">=5\")>0,TRUE,FALSE)","v":false}]

{"sheet":"o_Tier_Int","index":29,"n_rows":19,"n_cols":16,"rows_kept":19,"cut":false,"hidden":false,"merged":[[18,1,18,4],[3,1,4,11],[6,1,6,2],[6,10,6,11],[15,1,15,4],[16,1,16,4],[17,1,17,4],[9,1,13,5],[7,3,7,6]]}
[]
[]
[]
[null,"Intervention Summary Report: Tiers"]
[]
[null,null,null,null,null,null,null,null,null,null,null,null,null,null,{"$f":"IF(D8=\"All\",\"*\",D8)","v":"*"}]
[null,"Time Frame:",null,1,null,null,"Filter:",2,null,"Date:",{"$f":"TODAY()","v":"2017-12-21"},null,null,"Yes","Year to date",{"$f":"IF(D7=6,0,D7)","v":1}]
[null,"Cohort:",null,{"$f":"SchoolRptCohort","v":"All"},null,null,null,null,null,null,null,null,null,"No"]
[]
[null,"This report shows the number and percentage of students who were assigned to Tier I, II, or III intervention programs, by type of intervention (academic, behavior, or attendance). Students are included if they were assigned to an intervention program at any point during the school year.",null,null,null,null,null,null,null,"Attendance","Behavior","Academic"]
[null,null,null,null,null,null,null,null,"Tier I",{"$f":"SUMPRODUCT((OFFSET(GraphicalOffset,0,J17-1)=1)*(IF($H$7=1,SchoolReportFilter,1))*(CohortReport=1))","v":0},0,0]
[null,null,null,null,null,null,null,null,"Tier II",0,0,0]
[null,null,null,null,null,null,null,null,"Tier III",0,0,0]
[]
[]
[null,"Total number of students",null,null,null,{"$f":"SUM(CohortReport)","v":1},null,null,null,"Att","Beh","Aca"]
["AnyT1Int","Percentage students in Tier I",null,null,null,{"$f":"IF($F$16=0,0,SUMPRODUCT((OFFSET(GraphicalOffset,0,MATCH($A17,c_ReportData!$12:$12,0)-1))*(CohortReport=1))/$F$16)","v":0},null,null,"Tier1",{"$f":"MATCH(J$16&$I17,c_ReportData!$12:$12,0)","v":67},{"$f":"MATCH(K$16&$I17,c_ReportData!$12:$12,0)","v":70},{"$f":"MATCH(L$16&$I17,c_ReportData!$12:$12,0)","v":73}]
["AnyT2Int","Percentage students in Tier II",null,null,null,{"$f":"IF($F$16=0,0,SUMPRODUCT((OFFSET(GraphicalOffset,0,MATCH($A18,c_ReportData!$12:$12,0)-1))*(CohortReport=1))/$F$16)","v":0},null,null,"Tier2",{"$f":"MATCH(J$16&$I18,c_ReportData!$12:$12,0)","v":68},{"$f":"MATCH(K$16&$I18,c_ReportData!$12:$12,0)","v":71},{"$f":"MATCH(L$16&$I18,c_ReportData!$12:$12,0)","v":74}]
["AnyT3Int","Percentage students in Tier III",null,null,null,{"$f":"IF($F$16=0,0,SUMPRODUCT((OFFSET(GraphicalOffset,0,MATCH($A19,c_ReportData!$12:$12,0)-1))*(CohortReport=1))/$F$16)","v":0},null,null,"Tier3",{"$f":"MATCH(J$16&$I19,c_ReportData!$12:$12,0)","v":69},{"$f":"MATCH(K$16&$I19,c_ReportData!$12:$12,0)","v":72},{"$f":"MATCH(L$16&$I19,c_ReportData!$12:$12,0)","v":75}]

{"sheet":"o_IndDisability","index":30,"n_rows":51,"n_cols":20,"rows_kept":51,"cut":false,"hidden":false,"merged":[[9,1,9,4],[10,1,10,4],[11,1,11,4],[3,1,4,11],[6,1,6,2],[6,10,6,11],[9,7,11,11],[7,3,7,6]]}
[]
[]
[]
[null,"Risk Indicator Summary Report: Disability Categories"]
[]
[null,null,null,null,null,null,null,null,null,null,null,null,null,null,null,{"$f":"IF(D8=\"All\",\"*\",D8)","v":"*"},null,{"$f":"INDEX($R$7:$R$14,$D$7)","v":28}]
[null,"Time Frame:",null,1,null,null,"Filter:",2,null,"Date:",{"$f":"TODAY()","v":"2017-12-21"},null,null,"ArrGP1_days","Yes",{"$f":"i_Settings!$B12","v":"Quarter 1"},"GP1_Any flag",{"$f":"MATCH($Q7,c_ReportData!$12:$12,0)-1","v":28},"Disability",{"$f":"MATCH($S7,c_ReportData!$12:$12,0)-1","v":10}]
[null,"Cohort:",null,{"$f":"SchoolRptCohort","v":"All"},null,null,null,null,null,null,null,null,null,"ArrGP2_days","No",{"$f":"i_Settings!$B13","v":"Quarter 2"},"GP2_Any flag",{"$f":"MATCH($Q8,c_ReportData!$12:$12,0)-1","v":35}]
[null,null,null,null,null,null,null,null,null,null,null,null,null,"ArrGP3_days",null,{"$f":"i_Settings!$B14","v":"Quarter 3"},"GP3_Any flag",{"$f":"MATCH($Q9,c_ReportData!$12:$12,0)-1","v":41}]
[null,"Total Number of Students",null,null,null,{"$f":"SUMPRODUCT((INDIRECT(INDEX($N$7:$N$11,$D$7))<>0)*(CohortReport))","v":1},null,"This report shows the number of students with disabilities who are flagged and not flagged for any indicator of risk for the selected grading period or time frame.",null,null,null,null,null,"ArrGP4_days",null,{"$f":"i_Settings!$B15","v":"Quarter 4"},"GP4_Any flag",{"$f":"MATCH($Q10,c_ReportData!$12:$12,0)-1","v":47}]
[null,"Total Number of Students With Disabilities",null,null,null,{"$f":"SUMPRODUCT((Disability_flag=1)*(INDIRECT(INDEX($N$7:$N$11,$D$7))<>0)*(CohortReport=1))","v":0},null,null,null,null,null,null,null,"EOY_status",null,"End of year","eoy_Any flag",{"$f":"MATCH($Q11,c_ReportData!$12:$12,0)-1","v":59}]
[null,"Percent Students With Disabilities Flagged",null,null,null,{"$f":"IF(F11=0,0,SUM(C18:C41)/F11)","v":0}]
[]
[]
[]
[null,null,1,0,{"$f":"IF(COUNTIF(OFFSET(E18,0,0,F16),\">=5\")>0,TRUE,FALSE)","v":false},{"$f":"ROUND(CountDisabilities/2,0)","v":7}]
[null,null,"Flagged","Not Flagged",{"$f":"IF(COUNTIF(OFFSET(E18,F16,0,CountDisabilities-F16),\">=5\")>0,TRUE,FALSE)","v":false}]
[null,{"$f":"IF(i_Settings!B18=0,\"\",i_Settings!B18)","v":"Autism"},{"$f":"IF($B18=\"\",\"\",SUMPRODUCT((OFFSET(GraphicalOffset,0,$T$7)=$B18)*(OFFSET(GraphicalOffset,0,$R$6)=C$16)*(IF($H$7=1,SchoolReportFilter,1))*(CohortReport=1)))","v":0},0,{"$f":"SUM(C18:D18)","v":0}]
[null,{"$f":"IF(i_Settings!B19=0,\"\",i_Settings!B19)","v":"Deaf-blindness"},0,0,{"$f":"SUM(C19:D19)","v":0}]
[null,{"$f":"IF(i_Settings!B20=0,\"\",i_Settings!B20)","v":"Emotional disturbance"},0,0,0]
[null,{"$f":"IF(i_Settings!B21=0,\"\",i_Settings!B21)","v":"Hearing impairment (including deafness)"},0,0,0]
[null,{"$f":"IF(i_Settings!B22=0,\"\",i_Settings!B22)","v":"Mental retardation"},0,0,0]
[null,{"$f":"IF(i_Settings!B23=0,\"\",i_Settings!B23)","v":"Multiple disabilities"},0,0,0]
[null,{"$f":"IF(i_Settings!B24=0,\"\",i_Settings!B24)","v":"Orthopedic impairment"},0,0,0]
[null,{"$f":"IF(i_Settings!B25=0,\"\",i_Settings!B25)","v":"Other health impairment"},0,0,0]
[null,{"$f":"IF(i_Settings!B26=0,\"\",i_Settings!B26)","v":"Specific learning disability"},0,0,0]
[null,{"$f":"IF(i_Settings!B27=0,\"\",i_Settings!B27)","v":"Speech or language impairment"},0,0,0]
[null,{"$f":"IF(i_Settings!B28=0,\"\",i_Settings!B28)","v":"Traumatic brain injury"},0,0,0]
[null,{"$f":"IF(i_Settings!B29=0,\"\",i_Settings!B29)","v":"Visual impairment (including blindness)"},0,0,0]
[null,{"$f":"IF(i_Settings!B30=0,\"\",i_Settings!B30)","v":"Learning disability"},0,0,0]
[null,{"$f":"IF(i_Settings!B31=0,\"\",i_Settings!B31)","v":""},"","",0]
[null,{"$f":"IF(i_Settings!B32=0,\"\",i_Settings!B32)","v":""},"","",{"$f":"SUM(C32:D32)","v":0}]
[]
[]
[]
[]
[]
[]
[{"$f":"MATCH(V7,$P$21:$P$46,0)","v":{"$error":"#N/A"}}]
[{"$f":"MATCH(V8,$P$21:$P$46,0)","v":{"$error":"#N/A"}}]
[{"$f":"MATCH(B38,$P$21:$P$46,0)","v":{"$error":"#N/A"}}]
[{"$f":"MATCH(B39,$P$21:$P$46,0)","v":{"$error":"#N/A"}}]
[{"$f":"MATCH(B40,$P$21:$P$46,0)","v":{"$error":"#N/A"}}]
[{"$f":"MATCH(B41,$P$21:$P$46,0)","v":{"$error":"#N/A"}}]
[]
[]
[{"$f":"MATCH(B42,$P$21:$P$46,0)","v":{"$error":"#N/A"}}]
[]
[{"$f":"MATCH(B43,$P$21:$P$46,0)","v":{"$error":"#N/A"}}]
[{"$f":"MATCH(B44,$P$21:$P$46,0)","v":{"$error":"#N/A"}}]
[{"$f":"MATCH(B47,$P$21:$P$46,0)","v":{"$error":"#N/A"}}]

{"sheet":"o_IndELL","index":31,"n_rows":51,"n_cols":20,"rows_kept":51,"cut":false,"hidden":false,"merged":[[3,1,4,11],[6,1,6,2],[6,10,6,11],[9,1,9,4],[9,7,11,11],[10,1,10,4],[11,1,11,4],[7,3,7,6]]}
[]
[]
[]
[null,"Risk Indicator Summary Report: English Language Learner (ELL)"]
[]
[null,null,null,null,null,null,null,null,null,null,null,null,null,null,null,{"$f":"IF(D8=\"All\",\"*\",D8)","v":"*"},null,{"$f":"INDEX($R$7:$R$14,$D$7)","v":28}]
[null,"Time Frame:",null,1,null,null,"Filter:",2,null,"Date:",{"$f":"TODAY()","v":"2017-12-21"},null,null,"ArrGP1_days","Yes",{"$f":"i_Settings!$B12","v":"Quarter 1"},"GP1_Any flag",{"$f":"MATCH($Q7,c_ReportData!$12:$12,0)-1","v":28},"ELL Status",{"$f":"MATCH($S7,c_ReportData!$12:$12,0)-1","v":12}]
[null,"Cohort:",null,{"$f":"SchoolRptCohort","v":"All"},null,null,null,null,null,null,null,null,null,"ArrGP2_days","No",{"$f":"i_Settings!$B13","v":"Quarter 2"},"GP2_Any flag",{"$f":"MATCH($Q8,c_ReportData!$12:$12,0)-1","v":35}]
[null,null,null,null,null,null,null,null,null,null,null,null,null,"ArrGP3_days",null,{"$f":"i_Settings!$B14","v":"Quarter 3"},"GP3_Any flag",{"$f":"MATCH($Q9,c_ReportData!$12:$12,0)-1","v":41}]
[null,"Total Number of Students",null,null,null,{"$f":"SUMPRODUCT((INDIRECT(INDEX($N$7:$N$11,$D$7))<>0)*(CohortReport))","v":1},null,"This report shows the number of students who are designated English language learners who are flagged and not flagged for any indicator of risk for the selected grading period or time frame.",null,null,null,null,null,"ArrGP4_days",null,{"$f":"i_Settings!$B15","v":"Quarter 4"},"GP4_Any flag",{"$f":"MATCH($Q10,c_ReportData!$12:$12,0)-1","v":47}]
[null,"Total Number of ELL Students",null,null,null,{"$f":"SUMPRODUCT((ELL_flag=1)*(INDIRECT(INDEX($N$7:$N$11,$D$7))<>0)*(CohortReport=1))","v":0},null,null,null,null,null,null,null,"EOY_status",null,"End of year","eoy_Any flag",{"$f":"MATCH($Q11,c_ReportData!$12:$12,0)-1","v":59}]
[null,"Percent ELL Students Flagged",null,null,null,{"$f":"IF(F11=0,0,SUMIF($B$18:$B$41,\"<>No\",$C$18:$C$41)/F11)","v":0}]
[]
[]
[]
[null,null,1,0,{"$f":"IF(COUNTIF(E18:E31,\">=5\")>0,TRUE,FALSE)","v":false}]
[null,null,"Flagged","Not Flagged"]
[null,"No",{"$f":"SUMPRODUCT((OFFSET(GraphicalOffset,0,$T$7)=$A18)*(OFFSET(GraphicalOffset,0,$R$6)=C$16)*(IF($H$7=1,SchoolReportFilter,1))*(CohortReport=1))","v":0},{"$f":"SUMPRODUCT((OFFSET(GraphicalOffset,0,$T$7)=$A18)*(OFFSET(GraphicalOffset,0,$R$6)=D$16)*(IF($H$7=1,SchoolReportFilter,1))*(CohortReport=1))","v":0},{"$f":"SUM(C18:D18)","v":0}]
[{"$f":"IF(i_Settings!E18=0,\"\",i_Settings!E18)","v":"Yes"},{"$f":"A19","v":"Yes"},{"$f":"IF($A19=\"\",\"\",SUMPRODUCT((OFFSET(GraphicalOffset,0,$T$7)=$A19)*(OFFSET(GraphicalOffset,0,$R$6)=C$16)*(IF($H$7=1,SchoolReportFilter,1))*(CohortReport=1)))","v":0},0,0]
[{"$f":"IF(i_Settings!E19=0,\"\",i_Settings!E19)","v":""},"","","",0]
[{"$f":"IF(i_Settings!E20=0,\"\",i_Settings!E20)","v":""},"","","",0]
[{"$f":"IF(i_Settings!E21=0,\"\",i_Settings!E21)","v":""},"","","",0]
[{"$f":"IF(i_Settings!E22=0,\"\",i_Settings!E22)","v":""},"","","",0]
[{"$f":"IF(i_Settings!E23=0,\"\",i_Settings!E23)","v":""},"","","",0]
[{"$f":"IF(i_Settings!E24=0,\"\",i_Settings!E24)","v":""}]
[]
[]
[]
[]
[]
[]
[]
[null,{"$f":"IF(i_Settings!B32=0,\"\",i_Settings!B32)","v":""},{"$f":"IF($B33=\"\",\"\",SUMPRODUCT((OFFSET(GraphicalOffset,0,$T$7)=$B33)*(OFFSET(GraphicalOffset,0,$R$6)=C$16)*(IF($H$7=1,SchoolReportFilter,1))))","v":""},{"$f":"IF($B33=\"\",\"\",SUMPRODUCT((OFFSET(GraphicalOffset,0,$T$7)=$B33)*(OFFSET(GraphicalOffset,0,$R$6)=D$16)*(IF($H$7=1,SchoolReportFilter,1))))","v":""}]
[]
[]
[]
[]
[]
[{"$f":"MATCH(V7,$P$21:$P$46,0)","v":{"$error":"#N/A"}}]
[{"$f":"MATCH(V8,$P$21:$P$46,0)","v":{"$error":"#N/A"}}]
[{"$f":"MATCH(B38,$P$21:$P$46,0)","v":{"$error":"#N/A"}}]
[{"$f":"MATCH(B39,$P$21:$P$46,0)","v":{"$error":"#N/A"}}]
[{"$f":"MATCH(B40,$P$21:$P$46,0)","v":{"$error":"#N/A"}}]
[{"$f":"MATCH(B41,$P$21:$P$46,0)","v":{"$error":"#N/A"}}]
[]
[]
[{"$f":"MATCH(B42,$P$21:$P$46,0)","v":{"$error":"#N/A"}}]
[]
[{"$f":"MATCH(B43,$P$21:$P$46,0)","v":{"$error":"#N/A"}}]
[{"$f":"MATCH(B44,$P$21:$P$46,0)","v":{"$error":"#N/A"}}]
[{"$f":"MATCH(B47,$P$21:$P$46,0)","v":{"$error":"#N/A"}}]

{"sheet":"o_IndDis","index":32,"n_rows":51,"n_cols":20,"rows_kept":51,"cut":false,"hidden":false,"merged":[[11,1,11,4],[9,7,12,11],[3,1,4,11],[6,1,6,2],[6,10,6,11],[9,1,9,4],[10,1,10,4],[7,3,7,6]]}
[]
[]
[]
[null,"Risk Indicator Summary Report: Disadvantaged"]
[]
[null,null,null,null,null,null,null,null,null,null,null,null,null,null,null,{"$f":"IF(D8=\"All\",\"*\",D8)","v":"*"},null,{"$f":"INDEX($R$7:$R$14,$D$7)","v":59}]
[null,"Time Frame:",null,5,null,null,"Filter:",2,null,"Date:",{"$f":"TODAY()","v":"2017-12-21"},null,null,"ArrGP1_days","Yes",{"$f":"i_Settings!$B12","v":"Quarter 1"},"GP1_Any flag",{"$f":"MATCH($Q7,c_ReportData!$12:$12,0)-1","v":28},"Disadvantaged",{"$f":"MATCH($S7,c_ReportData!$12:$12,0)-1","v":11}]
[null,"Cohort:",null,{"$f":"SchoolRptCohort","v":"All"},null,null,null,null,null,null,null,null,null,"ArrGP2_days","No",{"$f":"i_Settings!$B13","v":"Quarter 2"},"GP2_Any flag",{"$f":"MATCH($Q8,c_ReportData!$12:$12,0)-1","v":35}]
[null,null,null,null,null,null,null,null,null,null,null,null,null,"ArrGP3_days",null,{"$f":"i_Settings!$B14","v":"Quarter 3"},"GP3_Any flag",{"$f":"MATCH($Q9,c_ReportData!$12:$12,0)-1","v":41}]
[null,"Total Number of Students",null,null,null,{"$f":"SUMPRODUCT((INDIRECT(INDEX($N$7:$N$11,$D$7))<>0)*(CohortReport))","v":0},null,"This report shows the number of students who are identified as economically disadvantaged (e.g., participate in the National School Lunch Program) who are flagged and not flagged for any indicator of risk for the selected grading period or time frame.",null,null,null,null,null,"ArrGP4_days",null,{"$f":"i_Settings!$B15","v":"Quarter 4"},"GP4_Any flag",{"$f":"MATCH($Q10,c_ReportData!$12:$12,0)-1","v":47}]
[null,"Total Number of Disadvantaged Students",null,null,null,{"$f":"SUMPRODUCT((Disadvantaged_flag=1)*(INDIRECT(INDEX($N$7:$N$11,$D$7))<>0)*(CohortReport=1))","v":0},null,null,null,null,null,null,null,"EOY_status",null,"End of year","eoy_Any flag",{"$f":"MATCH($Q11,c_ReportData!$12:$12,0)-1","v":59}]
[null,"Percent Disadvantaged Students Flagged",null,null,null,{"$f":"IF(F11=0,0,SUMIF($B$18:$B$41,\"<>No\",$C$18:$C$41)/F11)","v":0}]
[]
[]
[]
[null,null,1,0,{"$f":"IF(COUNTIF(E18:E31,\">=5\")>0,TRUE,FALSE)","v":false}]
[null,null,"Flagged","Not Flagged"]
[null,"No",{"$f":"SUMPRODUCT((OFFSET(GraphicalOffset,0,$T$7)=$A18)*(OFFSET(GraphicalOffset,0,$R$6)=C$16)*(IF($H$7=1,SchoolReportFilter,1))*(CohortReport=1))","v":0},{"$f":"SUMPRODUCT((OFFSET(GraphicalOffset,0,$T$7)=$A18)*(OFFSET(GraphicalOffset,0,$R$6)=D$16)*(IF($H$7=1,SchoolReportFilter,1))*(CohortReport=1))","v":0},{"$f":"SUM(C18:D18)","v":0}]
[{"$f":"IF(i_Settings!E28=0,\"\",i_Settings!E28)","v":"Yes"},{"$f":"A19","v":"Yes"},{"$f":"IF($A19=\"\",\"\",SUMPRODUCT((OFFSET(GraphicalOffset,0,$T$7)=$A19)*(OFFSET(GraphicalOffset,0,$R$6)=C$16)*(IF($H$7=1,SchoolReportFilter,1))*(CohortReport=1)))","v":0},0,{"$f":"SUM(C19:D19)","v":0}]
[{"$f":"IF(i_Settings!E29=0,\"\",i_Settings!E29)","v":""},"","","",0]
[{"$f":"IF(i_Settings!E30=0,\"\",i_Settings!E30)","v":""},"","","",0]
[{"$f":"IF(i_Settings!E31=0,\"\",i_Settings!E31)","v":""},"","","",0]
[{"$f":"IF(i_Settings!E32=0,\"\",i_Settings!E32)","v":""},"","","",0]
[{"$f":"IF(i_Settings!E33=0,\"\",i_Settings!E33)","v":""},"","","",0]
[{"$f":"IF(i_Settings!E34=0,\"\",i_Settings!E34)","v":""},"","","",{"$f":"SUM(C25:D25)","v":0}]
[]
[]
[]
[]
[]
[]
[]
[null,{"$f":"IF(i_Settings!B32=0,\"\",i_Settings!B32)","v":""},{"$f":"IF($B33=\"\",\"\",SUMPRODUCT((OFFSET(GraphicalOffset,0,$T$7)=$B33)*(OFFSET(GraphicalOffset,0,$R$6)=C$16)*(IF($H$7=1,SchoolReportFilter,1))))","v":""},{"$f":"IF($B33=\"\",\"\",SUMPRODUCT((OFFSET(GraphicalOffset,0,$T$7)=$B33)*(OFFSET(GraphicalOffset,0,$R$6)=D$16)*(IF($H$7=1,SchoolReportFilter,1))))","v":""}]
[]
[]
[]
[]
[]
[{"$f":"MATCH(V7,$P$21:$P$46,0)","v":{"$error":"#N/A"}}]
[{"$f":"MATCH(V8,$P$21:$P$46,0)","v":{"$error":"#N/A"}}]
[{"$f":"MATCH(B38,$P$21:$P$46,0)","v":{"$error":"#N/A"}}]
[{"$f":"MATCH(B39,$P$21:$P$46,0)","v":{"$error":"#N/A"}}]
[{"$f":"MATCH(B40,$P$21:$P$46,0)","v":{"$error":"#N/A"}}]
[{"$f":"MATCH(B41,$P$21:$P$46,0)","v":{"$error":"#N/A"}}]
[]
[]
[{"$f":"MATCH(B42,$P$21:$P$46,0)","v":{"$error":"#N/A"}}]
[]
[{"$f":"MATCH(B43,$P$21:$P$46,0)","v":{"$error":"#N/A"}}]
[{"$f":"MATCH(B44,$P$21:$P$46,0)","v":{"$error":"#N/A"}}]
[{"$f":"MATCH(B47,$P$21:$P$46,0)","v":{"$error":"#N/A"}}]

{"sheet":"Changelog","index":33,"n_rows":31,"n_cols":4,"rows_kept":31,"cut":false,"hidden":false,"merged":[[1,1,1,3]]}
[]
[null,"Change log started from version 0.86"]
[]
[]
[null,"Version","Changes","Date"]
[null,"3.0e"," - Hidden the filter buttons in the risk status sheet\n - Fixed a formatting bug in the performance data sheet where the greying out of rows for dropped/transferred out students was leaking into column A","2011-07-11"]
[null,"3.0d"," - Performance data sheet is now completely locked down as per AIR's request. Users can now only enter data via the import button.","2011-06-16"]
[null,"3.0c"," - Added data validation on the GP dates in the tool settings sheet\n - Corrected YTD attendance totals in performance data sheet\n - Corrected CCSR indicator flag calculations (credits and core course fails were offset by one column)\n - Updated derived 'Any flag' field to include end of year indicators so that the full year student reports show students who are only have ccsr flags\n - Updated formulas for calculating drop outs and transfer outs in the indicator summry report so that they take the cohort into account","2011-06-01"]
[null,"3.0b"," - Fixed issue with intervention lists not updating as more are added\n - Fixed issue with blank imported incoming statuses being treated as flagged rather than missing data\n - Fixed issue with enrollment status charts not showing data\n - Fixed issue with students not in cohorts not showing up in charts - they are now included in 'Any cohort'\n - Fixed issue with report summary boxes not showing numbers relevant to the selected cohort\n - Fixed issue with student level reports not showing data\n - Fixed detailed student report\n - Fixed Incoming Indicator of Risk and Incoming Indicator of Risk Transition reports\n - Fixed chart template in one of the school level reports","2011-05-19"]
[null,"3.0b"," - Fixed issue with csv exports not wrapping values in quotes causing fields with commas to be out of synch with field headings\n - Fixed issue with performance data sheet not correctly updating conditional formats when number of students is decreased or increased","2011-05-17"]
[null,"3.0.1a"," - Updated pre-HS text on button in performance data page\n - Cleared out some left over student information data used for testing\n - Updated help text on main menu to refer to 'Student Incoming Risk Status' rather than 'Student Pre-High School Risk Status'\n - Updated pre-HS heading on data importing form","2011-05-13"]
[null,"3.0a"," - Added custom group variable (cohort)\n - Added cohort as a view option in student information and updated list so it matches the order of sections in the table\n - Added cohort filter to reports control panel, risk status and intervention summary report\n - Added cohort filter setting to all student level reports (custom reports excluded - cannot easily include cohort filters here, but I don't they are used anyway)\n - Locked down tool to prevent pasting of data with the exception of student information and intervention settings\n - Updated a few bits of code so that when only one student has been entered, reports will output results correctly\n - Updated conditional formatting on performance data sheet so that boxes are drawn around all data entry cells as long as a student ID exists for the record (previously it only drew boxes around data that had been entered)\n - Updated pre-HS indicator name in pre-HS sheet (renamed the sheet as well), performance data, risk status, individual student report, interventions sheet and summary report, and all student/school level reports where applicable.\n - Added Top and Left positions for some help text boxes to help prevent pop ups from covering the button used to create the pop up.","2011-05-10"]
[null,"?"," - Fixed intervention types and tiers showing as 0s on the detailed student report","2011-05-06"]
[null,"?"," - Fixed total count on intervention summary report where type and tier were not set in intervention settings","2011-05-04"]
[null,"?"," - Fixed issue with blank intervention dates appearing as 01/01/1900 in the detailed student report","2011-04-15"]
[null,"?"," - Fixed a bug with the school level disability categories report where the addition of 2 extra disabilities would cause the second graph to be labeled/formatted incorrectly","2011-03-14"]
[null,1.5," - Added the new instructions sheet and set this to be the screen on open\n - Changed the formats to match those sent\n - Changed the help buttons\n - Changed the text to add \"Flag for\" and Risk indicators on the sheets i_IndCalcs, o_IntSum and i_PerfData","2010-07-26"]
[null,"1.03a"," - Students who have transferred out are now grayed out in the performance data sheet\n - Removed student characteristics school level report\n - Added indicators by disability school level report\n - Updated custom student level reports to allow user to select multiple fields at once from the list boxes","2010-05-26"]
[null,1.03," - Fixed various errors in school level reports\n - Students who have transferred out are now grayed out in indicators sheet\n - Students who have transferred out will not have end of year indicators calculated any more\n - Removed graduation report\n - Corrected formulas in student interventions sheet so that interventions are correctly picked up in time frame reports\n - Fixed drop down menus in student info not showing the correct lists (disability, race/ethnicity, ELL, disadvantaged)\n - Move the annual credits and core course fails indicators next to the end of year indicator and both are now hidden\n - Added a filter to the indicators sheet to allow the user to view students with characterisitics","2010-05-25"]
[null,1.02," - Removed logo from school information sheet as it was sometimes causing layout issues\n - Added a check box in the help text editor sheet to hide the button in the tool settings\n - Slightly changed the layout of navigation controls on each sheet to be more consistent and added progress labels where appropriate\n - Fixed issue where only one intervention was showing in the intervention drop down lists\n - Added message on indicators sheet about right-clicking to assign to an intervention\n - Fixed filters for Q3/Q4 flagged student reports\n - Fixed conditional formatting in the detailed student reports\n - Added help pop-ups to all reports\n - Removed student intervention button from main menu (users should be using the indicators sheet to assign interventions)\n - Made some threshold labels a bit clearer and added an annual attendance threshold\n - Fixed an issue with the school reports where non-existent students were sometimes showing up\n - Fixed issue with pre-HS indicators being reversed when flag was calculated in indicators sheet\n - Fixed issue with end of year indicator being pulled from student below in student interventions sheet\n - Added digital certificate to tool - should make macro activation a bit smoother as it only needs to be done once","2010-05-18"]
[null,1.01," - Removed cohort tracking\n - Removed import functionality from student interventions data\n - Added button to delete interventions in student interventions sheet\n - Added student names to interventions data\n - Users can now right click on a student in the indicators sheet to assign them to an intervention\n - Included a macro warning on the main menu to prompt users to enable macros\n    > The message disappears when macros are enabled and reappears when the tool is closed\n - Built a system to display help pop-ups for each sheet accessed via '?' icons in the sheet headings\n - Protected all of the sheets which also allows users to tab through data entry cells\n - Updated main menu title\n - Users can now upload school logos to the school information sheet (also adds logo to all sheet headers)\n - Changed zip codes to text format to allow data to start with a 0\n - Phone and fax numbers are now formatted with hyphons automatically\n - Pre-populated disability and ethnicity dropdowns with federal designations\n    > Tool now auto updates the drop down boxes when users edit the lists in the settings\n    > Added ELL status drop down list\n    > Converted disadvantaged status to drop down (Yes/No only)\n - Risk indicators now only contain a default and a custom list (the tool will always use the default unless a custom threshold is entered)\n - Intervention type and tier are now drop downs in the intervention settings sheet\n - Fixed the student info headers sometimes becoming drop downs\n - When changing the grading period format of the tool, non-relevant periods are hidden now from view in other sheets\n - If a user attempts to enter an invalid item in a dropdown box, the error message now directs them to the settings\n - Fixed the imprting of pre-HS data causing the headers to disappear\n - Student names/IDs are linked into the pre-HS data sheet\n - Pre-HS indicator is now displayed as Yes/No rather than Off/On-track\n - Included space for additional fields in pre-HS sheet\n - Turned off background error checking to prevent small green warnings appearing in some cells\n - Fixed the add intervention button in the student interventions sheet\n - When importing data, the file name is removed from the text box after importing\n - Added brief descriptions to school level reports","2010-05-13"]
[null,1," - Fixed an issue where the 'AllData' named range was not being updated as the number of rows of formulas was changed in the c_reportdata sheet\n - Fixed an issue where deleting the student ID and cohort at the same time from the seach parameters in the i_Int sheet was not causing the filters to be removed from the table\n - Added a cohort field to the i_Int sheet so that the user doesn't need to create the field when importing data\n - Made improvements to any intervention drop down boxes so that they are linked to a single named range ('CurrInterventions')\n - Updated the student performance data importing so that the user does not need to create a tool ID themselves\n - Removed the checking for pre-set filters for the custom student level reports\n - Fixed various issues with conditional formatting\n - Fixed an error in the high level interventions summary which came about as a result of modifying the interventions data entry table\n - Fixed an error in the tiered intervention summary report which came about as a result of modifying the intervetnions data entry table\n - Fixed an error when counting the number of interventions for the student ID/cohort entered in the interventions sheet\n - Fixed an issue with loading pre-set filters due to reformatting of pre-set filters sheet\n - Updated all graphical reports to work with changing number of rows in c_reportdata","2010-04-30"]
[null,0.94," - Added vba code to student info sheet that will create the drop down boxes when entering students manually (adds drop downs after entering a student ID)\n - Updated high level intervention summary so that only the required number of rows of formulas are created upon opening the report\n - Huge improvement to overall efficiency by forcing the tool to update the number of rows of data to match the number of students entered into the student information sheet\n - Also allows the tool to work with an indefinite number of students (although will likely not cope too well beyond several thousand students)","2010-04-29"]
[null,0.93," - Updated graphical reports to use all 1500 rows of data\n - Added ability to create custom student level reports in reports control panel\n - Corrected spelling mistake in import userform\n - Made the pre-set filters sheet slightly more user friendly and reactivated the link from the control panel\n - Reintroduced the 'Apply filters' button to the control panel to allow the user to experiment with filters without having to generate a report each time\n - Improved the intervention processng upon exiting the i_Int sheet by disabling calculations whilst running the macro","2010-04-28"]
[null,0.92," - Fixed an error in the enrollment status report where it was counting the same 'Any flag' field for each indicator\n - Added the school level cohort graduation report\n    > Shows number of students with any flag in the chosen GP compared against the number that failed to meed graduation requirements\n    > Shows data for each cohort on the same graph\n - Testing the addition of multiple rows to data sheets (up to 1500 to cater for the larger schools)\n    > Unzipped .xls sheet increases to 18.5MB\n    > Performance doesn't noticeably deteriorate on a medium specced computer\n - Fixed error when creating student report without any filter settings (i.e. preset filters turned off and no custom filter settings)\n - Student level report formulas are now created when loading the report to avoid creating a report of 1500 rows every time\n - Updated the student level report definitions to take the grading period type into account (e.g. if semesters is selected, the reports won't try and show data from grading periods 3 and 4)\n - Updated the graphical reports so that end of year indicators are only shown for the 'End of year' time frame\n - Updated import data form so that when importing performance data, the user can only select grading periods as per the settings\n    > e.g. if semesters is selected, then the user can only import data into grading periods 1 or 2)","2010-04-27"]
[null,0.91," - Added remainder of student level reports:\n    > Off-track to on-track report\n        o Shows students who had any flag in a GP and then no flags in the following GP\n        o The time frame indicates at what point they came back on track\n    > On-track to off-track report\n    > Transition status report\n    > Student transfers\n - Removed 'EWS Tool' from main menu heading\n - Fixed student level report formatting so that date columns are correctly formatted\n - Added intervention name to student level report headings when creating an intervention report\n - Added VBA code to make intervention fields in student report slightly wider when creating report\n - Drop down boxes in reports control panel now have their headings greyed out when disabled to make it more obvious\n - Added school level intervention summary report\n - Improved the graph editing code so that whatever cell(s) the user had selected are re-selected after the graph is changed\n - Added dropdown to select grading periods in performance, indicators, and high level intervention summary sheets\n - Reformatted some of the sheets to make them more consistent\n - Filters are now working for the school level reports as well as the student level reports\n    > Each school level report has a dropdown called filter\n    > Setting it to 'Yes' will use the most recent filter that was applied to the data (student and school reports both work off of the same fllter settings)\n    > Setting the filter option to 'No' will force the report to use all the data in the tool\n    > There are no pre-set filters for the school level reports, when generating a report whatever filters have been selected in the control panel will be applied\n - Removed 'Current cohort' table from settings page as it was no longer doing anything\n - Removed the blue colouring from the risk indicator threshold headings as it made it appear that you could edit the cohort names ","2010-04-22"]
[null,0.9," - Added selection of student level reports:\n    > Off-track for graduation\n    > Intervention report\n    > Pre-high school interventions\n    > Student retention report\n    > Student drop outs\n - Updated reports control panel interface to include a drop down list of interventions for the new intervention report\n - Drop down boxes in the reports control panel now update depending on what report the user has selected\n - Removed a load of old report definitions","2010-04-21"]
[null,0.89," - Greyed out students who have dropped out in Performance Data and Indicator sheets\n - Removed an old conditional format in the performance data sheet\n - Hidden some columns in Indicators sheet to make it more continuous\n - Implemented system to keep track of cohorts from previous years\n    > Grading period days and dates and now entered in a separate sheet linked from the settings page\n    > Tool uses this sheet to lookup the relevant dates for the cohort that the student is in\n    > When overwriting data via the import system, any data for old cohorts must be contained in the upload file\n    > Every student must be assigned to a cohort now even if there is only one cohort of students\n - Reworked all lookups in the tool to work with this new cohort system\n    > When importing data for performance or interventions, student IDs need to have their cohort appended to them (e.g. 1234Cohort1)\n - Fixed an issue with the flags shown in the detailed student report and interventions data entry pages where data for the student in the row below was being returned\n - Updated interventions summary output to take into account the additional indicator at end of year\n - Reworked the reports control panel\n    > Added interventions summary and detailed student reports to the panel\n    > Removed these buttons from the main menu\n - Removed tabs from view, formula bar and column/row headings\n - Extended the number of student level report fields to 27, student ID field is no longer included by default as the new tool_ID is used as a lookup","2010-04-20"]
[null,0.88," - Fixed issue with filters not being applied across entire reporting dataset causing students to not appear in some student level reports\n - Changed course fails indicator to work with all course fails rather than core course fails\n - Changed attendance and GPA thresholds to be greater than or equal to and less than or equal to respectively\n - Added new annual threshold for core course fails to separate all and core fails at end of year\n - Added some missing 'Full year' report definitions to the student level reports\n - Updated graphical reports so that the number of bars shown will automatically update to reflect the number of relevant fields\n - Added the new end of year course fails indicator to all end of year/full year reports\n - Extended the number of student level report fields to 25 (26 including compulsory student ID field)\n - Updated list of fields available for custom filtering\n - Added an 'End of year' option to the Enrollment Status and Student Characteristics graphical reports\n - Additional trapping of missing data implemented into Detailed student report\n - Added error trap when looking up Pre-HS indicator in Indicators sheet ","2010-04-20"]
[null,0.87," - Added enrollment status and student characteristic graphical reports","2010-04-19"]
[null,0.86," - Created a macro to process the interventions data upon exiting the interventions sheet. Data is concatenated into strings to create a single field for each GP\n - Updated the student level characteristics reports to reflect the addition of the new intervention fields\n - Fixed the interventions summary ouput so that the totals for end of year match the data in the interventions sheet\n - Fixed the pre-HS indicators in the interventions summary\n - Corrected #REF! errors when looking up pre-HS indicators","2010-04-19"]

{"sheet":"FieldNames","index":34,"n_rows":96,"n_cols":8,"rows_kept":96,"cut":false,"hidden":true,"merged":[]}
["ActualName","OutputName (with GP types)","OutputName (without GP types)","Type","New fieldname","Quarters","Trimesters","Semesters"]
["Last Name","Last Name",null,null,{"$f":"IF(B2=\"\",A2,B2)","v":"Last Name"},"Last Name","Last Name","Last Name"]
["First Name","First Name",null,null,"First Name","First Name","First Name","First Name"]
["Student ID","Student ID",null,null,"Student ID","Student ID","Student ID","Student ID"]
["Grade","Grade",null,null,"Grade","Grade","Grade","Grade"]
["Phone #","Phone #",null,null,"Phone #","Phone #","Phone #","Phone #"]
["Guardian(s)","Guardian(s)",null,null,"Guardian(s)","Guardian(s)","Guardian(s)","Guardian(s)"]
["Email","Email",null,null,"Email","Email","Email","Email"]
["DOB","Date of Birth",null,null,"Date of Birth","Date of Birth","Date of Birth","Date of Birth"]
["Gender","Gender",null,null,"Gender","Gender","Gender","Gender"]
["Ethnicity","Ethnicity",null,null,"Ethnicity","Ethnicity","Ethnicity","Ethnicity"]
["Disability","Disability",null,null,"Disability","Disability","Disability","Disability"]
["Disadvantaged","Disadvantaged",null,null,"Disadvantaged","Disadvantaged","Disadvantaged","Disadvantaged"]
["ELL Status","ELL Status",null,null,"ELL Status","ELL Status","ELL Status","ELL Status"]
["Cohort","Cohort",null,null,"Cohort","Cohort","Cohort","Cohort"]
["Enrollment Status","Enrollment Status",null,null,"Enrollment Status","Enrollment Status","Enrollment Status","Enrollment Status"]
["Date of Status Change","Date of Status Change",null,null,"Date of Status Change","Date of Status Change","Date of Status Change","Date of Status Change"]
["Disability flag","Any Disability",null,"F","Any Disability","Any Disability","Any Disability","Any Disability"]
["ELL flag","Any ELL",null,"F","Any ELL","Any ELL","Any ELL","Any ELL"]
["Disadvantaged flag","Any Disadvantaged",null,"F","Any Disadvantaged","Any Disadvantaged","Any Disadvantaged","Any Disadvantaged"]
["No char flag","No Characteristic",null,"F","No Characteristic","Any Characteristic","Any Characteristic","Any Characteristic"]
["Any char flag","Any Characteristic",null,"F","Any Characteristic","Incoming Risk Indicator","Incoming Risk Indicator","Incoming Risk Indicator"]
["Pre-HS Indicator","Incoming Risk Indicator",null,"Flag","Incoming Risk Indicator","Exam Risk Indicator","Exam Risk Indicator","Exam Risk Indicator"]
["Exam Indicator","Exam Risk Indicator",null,"Flag","Exam Risk Indicator","Quarter 1 First 20 Day Attendance Flag","Trimester 1 First 20 Day Attendance Flag","Semester 1 First 20 Day Attendance Flag"]
[{"$f":"\"GP1_First \"&EarlyAtt&\" Day Attendance\"","v":"GP1_First 20 Day Attendance"},{"$f":"i_Settings!$B$12&\" \"&C25","v":"Quarter 1 First 20 Day Attendance Flag"},{"$f":"\"First \"&EarlyAtt&\" Day Attendance Flag\"","v":"First 20 Day Attendance Flag"},"Flag","Quarter 1 First 20 Day Attendance Flag","Quarter 1 Attendance Flag","Trimester 1 Attendance Flag","Semester 1 Attendance Flag"]
["GP1_Attendance",{"$f":"i_Settings!$B$12&\" \"&C26","v":"Quarter 1 Attendance Flag"},"Attendance Flag","Flag","Quarter 1 Attendance Flag","Quarter 1 English Course Fail Flag","Trimester 1 English Course Fail Flag","Semester 1 English Course Fail Flag"]
["GP1_EngCourseFail",{"$f":"i_Settings!$B$12&\" \"&C27","v":"Quarter 1 English Course Fail Flag"},"English Course Fail Flag","Flag","Quarter 1 English Course Fail Flag","Quarter 1 Math Course Fail Flag","Trimester 1 Math Course Fail Flag","Semester 1 Math Course Fail Flag"]
["GP1_MathCourseFail",{"$f":"i_Settings!$B$12&\" \"&C28","v":"Quarter 1 Math Course Fail Flag"},"Math Course Fail Flag","Flag","Quarter 1 Math Course Fail Flag","Quarter 1 Behavior Flag","Trimester 1 Behavior Flag","Semester 1 Behavior Flag"]
["GP1_Behavior",{"$f":"i_Settings!$B$12&\" \"&C29","v":"Quarter 1 Behavior Flag"},"Behavior Flag","Flag","Quarter 1 Behavior Flag","Quarter 1 Any Flag","Trimester 1 Any Flag","Semester 1 Any Flag"]
["GP1_Any Flag",{"$f":"i_Settings!$B$12&\" \"&C30","v":"Quarter 1 Any Flag"},"Any Flag","Flag","Quarter 1 Any Flag","Quarter 1 Any Attendance Flag","Trimester 1 Any Attendance Flag","Semester 1 Any Attendance Flag"]
["GP1_Any att",{"$f":"i_Settings!$B$12&\" \"&C31","v":"Quarter 1 Any Attendance Flag"},"Any Attendance Flag","Flag","Quarter 1 Any Attendance Flag","Quarter 1 Any Academic Flag","Trimester 1 Any Academic Flag","Semester 1 Any Academic Flag"]
["GP1_Any acad",{"$f":"i_Settings!$B$12&\" \"&C32","v":"Quarter 1 Any Academic Flag"},"Any Academic Flag","Flag","Quarter 1 Any Academic Flag","Quarter 2 Attendance Flag","Trimester 2 Attendance Flag","Semester 2 Attendance Flag"]
["GP2_Attendance",{"$f":"i_Settings!$B$13&\" \"&C33","v":"Quarter 2 Attendance Flag"},"Attendance Flag","Flag","Quarter 2 Attendance Flag","Quarter 2 English Course Fail Flag","Trimester 2 English Course Fail Flag","Semester 2 English Course Fail Flag"]
["GP2_EngCourseFail",{"$f":"i_Settings!$B$13&\" \"&C34","v":"Quarter 2 English Course Fail Flag"},"English Course Fail Flag","Flag","Quarter 2 English Course Fail Flag","Quarter 2 Math Course Fail Flag","Trimester 2 Math Course Fail Flag","Semester 2 Math Course Fail Flag"]
["GP2_MathCourseFail",{"$f":"i_Settings!$B$13&\" \"&C35","v":"Quarter 2 Math Course Fail Flag"},"Math Course Fail Flag","Flag","Quarter 2 Math Course Fail Flag","Quarter 2 Behavior Flag","Trimester 2 Behavior Flag","Semester 2 Behavior Flag"]
["GP2_Behavior",{"$f":"i_Settings!$B$13&\" \"&C36","v":"Quarter 2 Behavior Flag"},"Behavior Flag","Flag","Quarter 2 Behavior Flag","Quarter 2 Any Flag","Trimester 2 Any Flag","Semester 2 Any Flag"]
["GP2_Any Flag",{"$f":"i_Settings!$B$13&\" \"&C37","v":"Quarter 2 Any Flag"},"Any Flag","Flag","Quarter 2 Any Flag","Quarter 2 Any Academic Flag","Trimester 2 Any Academic Flag","Semester 2 Any Academic Flag"]
["GP2_Any acad",{"$f":"i_Settings!$B$13&\" \"&C38","v":"Quarter 2 Any Academic Flag"},"Any Academic Flag","Flag","Quarter 2 Any Academic Flag","Quarter 3 Attendance Flag","Trimester 3 Attendance Flag","Any Flag"]
["GP3_Attendance",{"$f":"i_Settings!$B$14&\" \"&C39","v":"Quarter 3 Attendance Flag"},"Attendance Flag","Flag","Quarter 3 Attendance Flag","Quarter 3 English Course Fail Flag","Trimester 3 English Course Fail Flag","Any Attendance Flag"]
["GP3_EngCourseFail",{"$f":"i_Settings!$B$14&\" \"&C40","v":"Quarter 3 English Course Fail Flag"},"English Course Fail Flag","Flag","Quarter 3 English Course Fail Flag","Quarter 3 Math Course Fail Flag","Trimester 3 Math Course Fail Flag","Any Academic Flag"]
["GP3_MathCourseFail",{"$f":"i_Settings!$B$14&\" \"&C41","v":"Quarter 3 Math Course Fail Flag"},"Math Course Fail Flag","Flag","Quarter 3 Math Course Fail Flag","Quarter 3 Behavior Flag","Trimester 3 Behavior Flag","End of Year Attendance Flag"]
["GP3_Behavior",{"$f":"i_Settings!$B$14&\" \"&C42","v":"Quarter 3 Behavior Flag"},"Behavior Flag","Flag","Quarter 3 Behavior Flag","Quarter 3 Any Flag","Trimester 3 Any Flag","End of Year English Course Fail Flag"]
["GP3_Any Flag",{"$f":"i_Settings!$B$14&\" \"&C43","v":"Quarter 3 Any Flag"},"Any Flag","Flag","Quarter 3 Any Flag","Quarter 3 Any Academic Flag","Trimester 3 Any Academic Flag","End of Year Math Course Fail Flag"]
["GP3_Any acad",{"$f":"i_Settings!$B$14&\" \"&C44","v":"Quarter 3 Any Academic Flag"},"Any Academic Flag","Flag","Quarter 3 Any Academic Flag","Quarter 4 Attendance Flag","Any Flag","End of Year Behavior Flag"]
["GP4_Attendance",{"$f":"i_Settings!$B$15&\" \"&C45","v":"Quarter 4 Attendance Flag"},"Attendance Flag","Flag","Quarter 4 Attendance Flag","Quarter 4 English Course Fail Flag","Any Attendance Flag","End of Year Any Flag"]
["GP4_EngCourseFail",{"$f":"i_Settings!$B$15&\" \"&C46","v":"Quarter 4 English Course Fail Flag"},"English Course Fail Flag","Flag","Quarter 4 English Course Fail Flag","Quarter 4 Math Course Fail Flag","Any Academic Flag","End of Year Any Academic Flag"]
["GP4_MathCourseFail",{"$f":"i_Settings!$B$15&\" \"&C47","v":"Quarter 4 Math Course Fail Flag"},"Math Course Fail Flag","Flag","Quarter 4 Math Course Fail Flag","Quarter 4 Behavior Flag","Any Behavior Flag","Semester 1 Both Attendance and Academic Flags"]
["GP4_Behavior",{"$f":"i_Settings!$B$15&\" \"&C48","v":"Quarter 4 Behavior Flag"},"Behavior Flag","Flag","Quarter 4 Behavior Flag","Quarter 4 Any Flag","End of Year Attendance Flag","Semester 2 Both Attendance and Academic Flags"]
["GP4_Any Flag",{"$f":"i_Settings!$B$15&\" \"&C49","v":"Quarter 4 Any Flag"},"Any Flag","Flag","Quarter 4 Any Flag","Quarter 4 Any Academic Flag","End of Year English Course Fail Flag","End of Year Both Attendance and Academic Flags"]
["GP4_Any acad",{"$f":"i_Settings!$B$15&\" \"&C50","v":"Quarter 4 Any Academic Flag"},"Any Academic Flag","Flag","Quarter 4 Any Academic Flag","Any Flag","End of Year Math Course Fail Flag","Participated in Tier 1 Attendance Intervention"]
["Any Flag","Any Flag",null,"Flag","Any Flag","Any Attendance Flag","End of Year Behavior Flag","Participated in Tier 2 Attendance Intervention"]
["Any att","Any Attendance Flag",null,"Flag","Any Attendance Flag","Any Academic Flag","End of Year Any Flag","Participated in Tier 3 Attendance Intervention"]
["Any acad","Any Academic Flag",null,"Flag","Any Academic Flag","Any Behavior Flag","End of Year Any Academic Flag","Participated in Tier 1 Behavior Intervention"]
["Any beh","Any Behavior Flag",null,"Flag","Any Behavior Flag","End of Year Attendance Flag","Trimester 1 Both Attendance and Academic Flags","Participated in Tier 2 Behavior Intervention"]
["eoy_Attendance","End of Year Attendance Flag",null,"Flag","End of Year Attendance Flag","End of Year English Course Fail Flag","Trimester 2 Both Attendance and Academic Flags","Participated in Tier 3 Behavior Intervention"]
["eoy_EngCourseFail","End of Year English Course Fail Flag",null,"Flag","End of Year English Course Fail Flag","End of Year Math Course Fail Flag","Trimester 3 Both Attendance and Academic Flags","Participated in Tier 1 Academic Intervention"]
["eoy_MathCourseFail","End of Year Math Course Fail Flag",null,"Flag","End of Year Math Course Fail Flag","End of Year Behavior Flag","End of Year Both Attendance and Academic Flags","Participated in Tier 2 Academic Intervention"]
["eoy_Behavior","End of Year Behavior Flag",null,"Flag","End of Year Behavior Flag","End of Year Any Flag","Participated in Tier 1 Attendance Intervention","Participated in Tier 3 Academic Intervention"]
[null,"End of Year CCSR Indicator Flag",null,"Flag","End of Year CCSR Indicator Flag","End of Year Any Academic Flag","Participated in Tier 2 Attendance Intervention","Semester 1 Interventions"]
["eoy_Core course fails","End of Year Core Course Fails Flag",null,"Flag","End of Year Core Course Fails Flag","Quarter 1 Both Attendance and Academic Flags","Participated in Tier 3 Attendance Intervention","Semester 2 Interventions"]
["eoy_Credits earned","End of Year Credits Earned Flag",null,"Flag","End of Year Credits Earned Flag","Quarter 2 Both Attendance and Academic Flags","Participated in Tier 1 Behavior Intervention","All Interventions"]
["eoy_Any flag","End of Year Any Flag",null,"Flag","End of Year Any Flag","Quarter 3 Both Attendance and Academic Flags","Participated in Tier 2 Behavior Intervention","Student is Overage"]
["eoy_Any acad","End of Year Any Academic Flag",null,"Flag","End of Year Any Academic Flag","Quarter 4 Both Attendance and Academic Flags","Participated in Tier 3 Behavior Intervention"]
["GP1_Attendance & Academic",{"$f":"i_Settings!$B$12&\" \"&C64","v":"Quarter 1 Both Attendance and Academic Flags"},"Both Attendance and Academic Flags","Flag","Quarter 1 Both Attendance and Academic Flags","End of Year Both Attendance and Academic Flags","Participated in Tier 1 Academic Intervention"]
["GP2_Attendance & Academic",{"$f":"i_Settings!$B$13&\" \"&C65","v":"Quarter 2 Both Attendance and Academic Flags"},"Both Attendance and Academic Flags","Flag","Quarter 2 Both Attendance and Academic Flags","Participated in Tier 1 Attendance Intervention","Participated in Tier 2 Academic Intervention"]
["GP3_Attendance & Academic",{"$f":"i_Settings!$B$14&\" \"&C66","v":"Quarter 3 Both Attendance and Academic Flags"},"Both Attendance and Academic Flags","Flag","Quarter 3 Both Attendance and Academic Flags","Participated in Tier 2 Attendance Intervention","Participated in Tier 3 Academic Intervention"]
["GP4_Attendance & Academic",{"$f":"i_Settings!$B$15&\" \"&C67","v":"Quarter 4 Both Attendance and Academic Flags"},"Both Attendance and Academic Flags","Flag","Quarter 4 Both Attendance and Academic Flags","Participated in Tier 3 Attendance Intervention","Trimester 1 Interventions"]
["eoy_Attendance & Academic","End of Year Both Attendance and Academic Flags","Both Attendance and Academic Flags","Flag","End of Year Both Attendance and Academic Flags","Participated in Tier 1 Behavior Intervention","Trimester 2 Interventions"]
["AttTier1","Participated in Tier 1 Attendance Intervention",null,"F","Participated in Tier 1 Attendance Intervention","Participated in Tier 2 Behavior Intervention","Trimester 3 Interventions"]
["AttTier2","Participated in Tier 2 Attendance Intervention",null,"F","Participated in Tier 2 Attendance Intervention","Participated in Tier 3 Behavior Intervention","All Interventions"]
["AttTier3","Participated in Tier 3 Attendance Intervention",null,"F","Participated in Tier 3 Attendance Intervention","Participated in Tier 1 Academic Intervention","Student is Overage"]
["BehTier1","Participated in Tier 1 Behavior Intervention",null,"F",{"$f":"IF(B72=\"\",A72,B72)","v":"Participated in Tier 1 Behavior Intervention"},"Participated in Tier 2 Academic Intervention"]
["BehTier2","Participated in Tier 2 Behavior Intervention",null,"F","Participated in Tier 2 Behavior Intervention","Participated in Tier 3 Academic Intervention"]
["BehTier3","Participated in Tier 3 Behavior Intervention",null,"F","Participated in Tier 3 Behavior Intervention","Quarter 1 Interventions"]
["AcaTier1","Participated in Tier 1 Academic Intervention",null,"F","Participated in Tier 1 Academic Intervention","Quarter 2 Interventions"]
["AcaTier2","Participated in Tier 2 Academic Intervention",null,"F","Participated in Tier 2 Academic Intervention","Quarter 3 Interventions"]
["AcaTier3","Participated in Tier 3 Academic Intervention",null,"F","Participated in Tier 3 Academic Intervention","Quarter 4 Interventions"]
["EOY status flag","Combined Enrollment Status and CCSR End of Year Flag",null,null,"Combined Enrollment Status and CCSR End of Year Flag","All Interventions"]
["Drop/transfer out","Enrollment Status and GP of Status Change",null,null,"Enrollment Status and GP of Status Change","Student is Overage"]
["Pre-HS Interventions","Pre-HS Interventions",null,null,"Pre-HS Interventions"]
["GP1 Interventions",{"$f":"i_Settings!$B$12&\" \"&C81","v":"Quarter 1 Interventions"},"Interventions",null,"Quarter 1 Interventions"]
["GP2 Interventions",{"$f":"i_Settings!$B$13&\" \"&C82","v":"Quarter 2 Interventions"},"Interventions",null,"Quarter 2 Interventions"]
["GP3 Interventions",{"$f":"i_Settings!$B$14&\" \"&C83","v":"Quarter 3 Interventions"},"Interventions",null,"Quarter 3 Interventions"]
["GP4 Interventions",{"$f":"i_Settings!$B$15&\" \"&C84","v":"Quarter 4 Interventions"},"Interventions",null,"Quarter 4 Interventions"]
["All interventions","All Interventions",null,null,"All Interventions"]
["GP1_Int sum",{"$f":"i_Settings!$B$12&\" \"&C86","v":"Quarter 1 Participated in Selected Intervention (school report)"},"Participated in Selected Intervention (school report)","F","Quarter 1 Participated in Selected Intervention (school report)"]
["GP2_Int sum",{"$f":"i_Settings!$B$13&\" \"&C87","v":"Quarter 2 Participated in Selected Intervention (school report)"},"Participated in Selected Intervention (school report)","F","Quarter 2 Participated in Selected Intervention (school report)"]
["GP3_Int sum",{"$f":"i_Settings!$B$14&\" \"&C88","v":"Quarter 3 Participated in Selected Intervention (school report)"},"Participated in Selected Intervention (school report)","F","Quarter 3 Participated in Selected Intervention (school report)"]
["GP4_Int sum",{"$f":"i_Settings!$B$15&\" \"&C89","v":"Quarter 4 Participated in Selected Intervention (school report)"},"Participated in Selected Intervention (school report)","F","Quarter 4 Participated in Selected Intervention (school report)"]
["eoy_Int sum","Participated in Selected Intervention (school report)",null,"F","Participated in Selected Intervention (school report)"]
["FilterMatch","Student Captured by Filter",null,"F","Student Captured by Filter"]
["GP1_Int Flag",{"$f":"C92&\" \"&i_Settings!$B12","v":"Participated Quarter 1"},"Participated","F","Participated Quarter 1"]
["GP2_Int Flag",{"$f":"C93&\" \"&i_Settings!$B13","v":"Participated Quarter 2"},"Participated","F","Participated Quarter 2"]
["GP3_Int Flag",{"$f":"C94&\" \"&i_Settings!$B14","v":"Participated Quarter 3"},"Participated","F","Participated Quarter 3"]
["GP4_Int Flag",{"$f":"C95&\" \"&i_Settings!$B15","v":"Participated Quarter 4"},"Participated","F","Participated Quarter 4"]
["Overage","Student is Overage",null,"F","Student is Overage"]

{"sheet":"AdvancedFilter","index":35,"n_rows":2,"n_cols":2,"rows_kept":2,"cut":false,"hidden":true,"merged":[]}
["Password:","NHSCFilter"]
["status:","LOCKED"]